Building on marpe.caelum.ci.dev
(from ocaml/opam:debian-unstable)
2023-12-28 08:45.11 ---> using "0acd5aeaa8f7bc314514d9795d14a7f12ec72a6a5b11c5904350189734c6859b" from cache
/: (user (uid 1000) (gid 1000))
/: (env OPAMPRECISETRACKING 1)
/: (env OPAMUTF8 never)
/: (env OPAMEXTERNALSOLVER builtin-0install)
/: (env OPAMCRITERIA +removed)
/: (run (shell "sudo ln -f /usr/bin/opam-dev /usr/bin/opam"))
2023-12-28 08:45.11 ---> using "65c3237f501f7c75f3828458ecf2342bc41c98aaef8c6a7fd82bf46a58cb258c" from cache
/: (run (network host)
(shell "rm -rf ~/opam-repository && git clone -q 'https://github.com/ocaml/opam-repository' ~/opam-repository && git -C ~/opam-repository checkout -q 09658dd9ef7dd289dcc01656fdd823a595c96af3"))
2023-12-28 08:45.11 ---> using "f101de6297c1a31838b234ff2c992150780a6312fb5cf86981e0aed854f7089a" from cache
/: (run (shell "rm -rf ~/.opam && opam init -ya --bare --config ~/.opamrc-sandbox ~/opam-repository"))
Configuring from /home/opam/.opamrc-sandbox, then /home/opam/.opamrc, and finally from built-in defaults.
Checking for available remotes: rsync and local, git.
- you won't be able to use mercurial repositories unless you install the hg command on your system.
- you won't be able to use darcs repositories unless you install the darcs command on your system.
<><> Fetching repository information ><><><><><><><><><><><><><><><><><><><><><>
[default] Initialised
User configuration:
~/.profile is already up-to-date.
[NOTE] Make sure that ~/.profile is well sourced in your ~/.bashrc.
2023-12-28 08:45.11 ---> using "064a46cc7f01ead47d72c5d5a407a53ce6d147ef4cde87e82e6a9bbbcb665427" from cache
/: (run (cache (opam-archives (target /home/opam/.opam/download-cache)))
(network host)
(shell "opam switch create --repositories=default '4.14' '4.14.1'"))
<><> Installing new switch packages <><><><><><><><><><><><><><><><><><><><><><>
Switch invariant: ["ocaml-base-compiler" {= "4.14.1"} | "ocaml-system" {= "4.14.1"}]
<><> Processing actions <><><><><><><><><><><><><><><><><><><><><><><><><><><><>
-> installed base-bigarray.base
-> installed base-threads.base
-> installed base-unix.base
-> installed ocaml-options-vanilla.1
-> retrieved ocaml-base-compiler.4.14.1 (cached)
-> installed ocaml-base-compiler.4.14.1
-> installed ocaml-config.2
-> installed ocaml.4.14.1
Done.
# Run eval $(opam env --switch=4.14) to update the current shell environment
2023-12-28 08:45.11 ---> using "5afc1ae022c21bb125893ce0bb4c38efb51e86de08e636e05cc659a8dde97aea" from cache
/: (run (network host)
(shell "opam update --depexts"))
+ /usr/bin/sudo "apt-get" "update"
- Get:1 http://deb.debian.org/debian unstable InRelease [198 kB]
- Get:2 http://deb.debian.org/debian unstable/main amd64 Packages.diff/Index [63.6 kB]
- Ign:2 http://deb.debian.org/debian unstable/main amd64 Packages.diff/Index
- Get:3 http://deb.debian.org/debian unstable/main amd64 Packages [9618 kB]
- Fetched 9879 kB in 1s (6941 kB/s)
- Reading package lists...
2023-12-28 08:45.11 ---> using "2f33a16893747a4a39712c31d36cb1ddda1bdccd6d565a3d04b6791956aa2e60" from cache
/: (run (cache (opam-archives (target /home/opam/.opam/download-cache)))
(network host)
(shell "\
\nopam remove -y \"ollvm.0.99\"\
\nopam install -vy \"ollvm.0.99\"\
\nres=$?\
\nif [ $res = 31 ]; then\
\n if opam show -f x-ci-accept-failures: \"ollvm.0.99\" | grep -q '\"debian-unstable\"'; then\
\n echo \"This package failed and has been disabled for CI using the 'x-ci-accept-failures' field.\"\
\n exit 69\
\n fi\
\nfi\
\n\
\n\
\nexit $res\
\n"))
[NOTE] ollvm.0.99 is not installed.
Nothing to do.
The following actions will be performed:
=== install 6 packages
- install dune 3.12.1 [required by menhir]
- install menhir 20211128 [required by ollvm]
- install menhirLib 20211128 [required by menhir]
- install menhirSdk 20211128 [required by menhir]
- install ocamlfind 1.9.6 [required by ollvm]
- install ollvm 0.99
<><> Processing actions <><><><><><><><><><><><><><><><><><><><><><><><><><><><>
Processing 1/16:
Processing 2/16:
Processing 3/16:
-> retrieved ocamlfind.1.9.6 (cached)
Processing 4/16:
[ocamlfind: patch] applying 0001-Harden-test-for-OCaml-5.patch
Processing 5/16: [ocamlfind: patch]
-> retrieved menhir.20211128, menhirLib.20211128, menhirSdk.20211128 (cached)
-> retrieved ollvm.0.99 (cached)
Processing 5/16: [ocamlfind: ./configure]
-> retrieved dune.3.12.1 (cached)
Processing 6/16: [dune: ocaml 255] [ocamlfind: ./configure]
+ /home/opam/.opam/opam-init/hooks/sandbox.sh "build" "./configure" "-bindir" "/home/opam/.opam/4.14/bin" "-sitelib" "/home/opam/.opam/4.14/lib" "-mandir" "/home/opam/.opam/4.14/man" "-config" "/home/opam/.opam/4.14/lib/findlib.conf" "-no-custom" "-no-camlp4" (CWD=/home/opam/.opam/4.14/.opam-switch/build/ocamlfind.1.9.6)
- Welcome to findlib version 1.9.6
- Configuring core...
- Checking for #remove_directory...
- Testing threading model...
- systhread_supported: true
- Testing DLLs...
- Testing whether ppxopt can be supported...
- Checking for ocamlc -opaque...
- Checking for ocamlopt -g...
- Querying installation: META list not found
- make install will double-check installed META files
- Configuring libraries...
- unix: found
- dynlink: found
- bigarray: found
- compiler-libs: found
- dbm: not present (normal since 4.00)
- graphics: not present (normal since 4.09)
- num: not present (normal since 4.06)
- ocamlbuild: not present (normal since 4.03)
- ocamldoc: found (in +ocamldoc)
- raw_spacetime: not present (normal since 4.12)
- threads: found (in +threads)
- str: found
- labltk: not present (normal since 4.02)
- native dynlink: found
- camlp4: disabled
- bytes: found, installing fake library
- Configuration for stdlib written to site-lib-src/stdlib/META
- Configuration for unix written to site-lib-src/unix/META
- Configuration for dynlink written to site-lib-src/dynlink/META
- Configuration for bigarray written to site-lib-src/bigarray/META
- Configuration for compiler-libs written to site-lib-src/compiler-libs/META
- Configuration for ocamldoc written to site-lib-src/ocamldoc/META
- Configuration for threads written to site-lib-src/threads/META
- Configuration for str written to site-lib-src/str/META
- Configuration for bytes written to site-lib-src/bytes/META
- Detecting compiler arguments: (extractor built) ok
-
- About the OCAML core installation:
- Standard library: /home/opam/.opam/4.14/lib/ocaml
- Binaries: /home/opam/.opam/4.14/bin
- Manual pages: /home/opam/.opam/4.14/man
- Multi-threading type: posix
- The directory of site-specific packages will be
- site-lib: /home/opam/.opam/4.14/lib
- The configuration file is written to:
- findlib config file: /home/opam/.opam/4.14/lib/findlib.conf
- Software will be installed:
- Libraries: in <site-lib>/findlib
- Binaries: /home/opam/.opam/4.14/bin
- Manual pages: /home/opam/.opam/4.14/man
- topfind script: /home/opam/.opam/4.14/lib/ocaml
- Topfind ppxopt support: yes
- Toolbox: no
- Link custom runtime: no
- Need bytes compatibility: no
-
- Configuration has been written to Makefile.config
-
- You can now do 'make all', and optionally 'make opt', to build ocamlfind.
Processing 6/16: [dune: ocaml 255] [ocamlfind: make all]
+ /home/opam/.opam/opam-init/hooks/sandbox.sh "build" "make" "all" (CWD=/home/opam/.opam/4.14/.opam-switch/build/ocamlfind.1.9.6)
- for p in findlib; do ( cd src/$p; make all ) || exit; done
- make[1]: Entering directory '/home/opam/.opam/4.14/.opam-switch/build/ocamlfind.1.9.6/src/findlib'
- ocamllex fl_meta.mll
- 22 states, 392 transitions, table size 1700 bytes
- USE_CYGPATH="0"; \
- export USE_CYGPATH; \
- cat findlib_config.mlp | \
- ../../tools/patch '@CONFIGFILE@' '/home/opam/.opam/4.14/lib/findlib.conf' | \
- ../../tools/patch '@STDLIB@' '/home/opam/.opam/4.14/lib/ocaml' | \
- sed -e 's;@AUTOLINK@;true;g' \
- -e 's;@SYSTEM@;linux;g' \
- >findlib_config.ml
- if [ "true" = "true" ]; then \
- cp topfind.ml.in topfind.ml; \
- else \
- sed -e '/PPXOPT_BEGIN/,/PPXOPT_END/ d' topfind.ml.in \
- > topfind.ml ; \
- fi
- ocamldep *.ml *.mli >depend
- ocamlc -I +compiler-libs -opaque -I +unix -I +dynlink -g -c findlib_config.ml
- ocamlc -I +compiler-libs -opaque -I +unix -I +dynlink -g -c fl_split.ml
- ocamlc -I +compiler-libs -opaque -I +unix -I +dynlink -g -c fl_metatoken.ml
- ocamlc -I +compiler-libs -opaque -I +unix -I +dynlink -g -c fl_meta.ml
- ocamlc -I +compiler-libs -opaque -I +unix -I +dynlink -c fl_metascanner.mli
- ocamlc -I +compiler-libs -opaque -I +unix -I +dynlink -g -c fl_metascanner.ml
- ocamlc -I +compiler-libs -opaque -I +unix -I +dynlink -c fl_topo.mli
- ocamlc -I +compiler-libs -opaque -I +unix -I +dynlink -g -c fl_topo.ml
- ocamlc -I +compiler-libs -opaque -I +unix -I +dynlink -c fl_package_base.mli
- ocamlc -I +compiler-libs -opaque -I +unix -I +dynlink -g -c fl_package_base.ml
- File "fl_package_base.ml", line 304, characters 22-40:
- 304 | let pkg_ancestors = query_requirements predlist pkg in
- ^^^^^^^^^^^^^^^^^^
- Warning 6 [labels-omitted]: label preds was omitted in the application of this function.
- File "fl_package_base.ml", line 350, characters 18-36:
- 350 | let ancestors = query_requirements predlist package_name in
- ^^^^^^^^^^^^^^^^^^
- Warning 6 [labels-omitted]: label preds was omitted in the application of this function.
- File "fl_package_base.ml", line 375, characters 23-41:
- 375 | let pkg_ancestors = query_requirements predlist pkg in
- ^^^^^^^^^^^^^^^^^^
- Warning 6 [labels-omitted]: label preds was omitted in the application of this function.
- File "fl_package_base.ml", line 510, characters 16-35:
- 510 | ( let c = package_definitions search_path pkg.package_name in
- ^^^^^^^^^^^^^^^^^^^
- Warning 6 [labels-omitted]: label search_path was omitted in the application of this function.
- ocamlc -I +compiler-libs -opaque -I +unix -I +dynlink -c findlib.mli
- ocamlc -I +compiler-libs -opaque -I +unix -I +dynlink -g -c findlib.ml
- File "findlib.ml", line 390, characters 2-26:
- 390 | Fl_package_base.requires predlist pkg
- ^^^^^^^^^^^^^^^^^^^^^^^^
- Warning 6 [labels-omitted]: label preds was omitted in the application of this function.
- File "findlib.ml", line 396, characters 2-33:
- 396 | Fl_package_base.requires_deeply predlist pkglist
- ^^^^^^^^^^^^^^^^^^^^^^^^^^^^^^^
- Warning 6 [labels-omitted]: label preds was omitted in the application of this function.
- ocamlc -I +compiler-libs -opaque -I +unix -I +dynlink -g -c fl_args.ml
- ocamlc -I +compiler-libs -opaque -I +unix -I +dynlink -g -c fl_lint.ml
- ocamlc -I +compiler-libs -a -o findlib.cma findlib_config.cmo fl_split.cmo fl_metatoken.cmo fl_meta.cmo fl_metascanner.cmo fl_topo.cmo fl_package_base.cmo findlib.cmo fl_args.cmo fl_lint.cmo
- ocamlc -I +compiler-libs -opaque -I +unix -I +dynlink -g -c ocaml_args.ml
- ocamlc -I +compiler-libs -opaque -I +unix -I +dynlink -g -c frontend.ml
- File "frontend.ml", line 859, characters 10-39:
- 859 | Fl_package_base.package_users predicates1 packages1
- ^^^^^^^^^^^^^^^^^^^^^^^^^^^^^
- Warning 6 [labels-omitted]: label preds was omitted in the application of this function.
- ocamlc -I +compiler-libs -o ocamlfind -g findlib.cma unix.cma \
- -I +unix -I +dynlink ocaml_args.cmo frontend.cmo
- ocamlc -I +compiler-libs -opaque -I +unix -I +dynlink -c topfind.mli
- ocamlc -I +compiler-libs -opaque -I +unix -I +dynlink -g -c topfind.ml
- File "topfind.ml", line 128, characters 40-63:
- 128 | match Hashtbl.find Toploop.directive_table "ppx" with
- ^^^^^^^^^^^^^^^^^^^^^^^
- Alert deprecated: Toploop.directive_table
- File "topfind.ml", line 258, characters 4-27:
- 258 | Toploop.directive_table
- ^^^^^^^^^^^^^^^^^^^^^^^
- Alert deprecated: Toploop.directive_table
- File "topfind.ml", line 268, characters 4-27:
- 268 | Toploop.directive_table
- ^^^^^^^^^^^^^^^^^^^^^^^
- Alert deprecated: Toploop.directive_table
- File "topfind.ml", line 280, characters 4-27:
- 280 | Toploop.directive_table
- ^^^^^^^^^^^^^^^^^^^^^^^
- Alert deprecated: Toploop.directive_table
- File "topfind.ml", line 293, characters 4-27:
- 293 | Toploop.directive_table
- ^^^^^^^^^^^^^^^^^^^^^^^
- Alert deprecated: Toploop.directive_table
- File "topfind.ml", line 307, characters 4-27:
- 307 | Toploop.directive_table
- ^^^^^^^^^^^^^^^^^^^^^^^
- Alert deprecated: Toploop.directive_table
- File "topfind.ml", line 319, characters 4-27:
- 319 | Toploop.directive_table
- ^^^^^^^^^^^^^^^^^^^^^^^
- Alert deprecated: Toploop.directive_table
- ocamlc -I +compiler-libs -a -o findlib_top.cma topfind.cmo
- USE_CYGPATH="0"; \
- export USE_CYGPATH; \
- cat topfind_rd1.p | \
- ../../tools/patch '@SITELIB@' '/home/opam/.opam/4.14/lib' \
- >topfind
- ocamlc -I +compiler-libs -opaque -I +unix -I +dynlink -c fl_dynload.mli
- ocamlc -I +compiler-libs -opaque -I +unix -I +dynlink -g -c fl_dynload.ml
- ocamlc -I +compiler-libs -a -o findlib_dynload.cma fl_dynload.cmo
- make[1]: Leaving directory '/home/opam/.opam/4.14/.opam-switch/build/ocamlfind.1.9.6/src/findlib'
- make all-config
- make[1]: Entering directory '/home/opam/.opam/4.14/.opam-switch/build/ocamlfind.1.9.6'
- USE_CYGPATH="0"; \
- export USE_CYGPATH; \
- cat findlib.conf.in | \
- tools/patch '@SITELIB@' '/home/opam/.opam/4.14/lib' | \
- tools/patch '@FINDLIB_PATH@' '/home/opam/.opam/4.14/lib' -p >findlib.conf
- if ./tools/cmd_from_same_dir ocamlc; then \
- echo 'ocamlc="ocamlc.opt"' >>findlib.conf; \
- fi
- if ./tools/cmd_from_same_dir ocamlopt; then \
- echo 'ocamlopt="ocamlopt.opt"' >>findlib.conf; \
- fi
- if ./tools/cmd_from_same_dir ocamldep; then \
- echo 'ocamldep="ocamldep.opt"' >>findlib.conf; \
- fi
- if ./tools/cmd_from_same_dir ocamldoc; then \
- echo 'ocamldoc="ocamldoc.opt"' >>findlib.conf; \
- fi
- make[1]: Leaving directory '/home/opam/.opam/4.14/.opam-switch/build/ocamlfind.1.9.6'
Processing 6/16: [dune: ocaml 255] [ocamlfind: make opt]
+ /home/opam/.opam/opam-init/hooks/sandbox.sh "build" "make" "opt" (CWD=/home/opam/.opam/4.14/.opam-switch/build/ocamlfind.1.9.6)
- for p in findlib; do ( cd src/$p; make opt ) || exit; done
- make[1]: Entering directory '/home/opam/.opam/4.14/.opam-switch/build/ocamlfind.1.9.6/src/findlib'
- ocamlopt -I +compiler-libs -g -opaque -I +unix -I +dynlink -c findlib_config.ml
- ocamlopt -I +compiler-libs -g -opaque -I +unix -I +dynlink -c fl_split.ml
- ocamlopt -I +compiler-libs -g -opaque -I +unix -I +dynlink -c fl_metatoken.ml
- ocamlopt -I +compiler-libs -g -opaque -I +unix -I +dynlink -c fl_meta.ml
- ocamlopt -I +compiler-libs -g -opaque -I +unix -I +dynlink -c fl_metascanner.ml
- ocamlopt -I +compiler-libs -g -opaque -I +unix -I +dynlink -c fl_topo.ml
- ocamlopt -I +compiler-libs -g -opaque -I +unix -I +dynlink -c fl_package_base.ml
- File "fl_package_base.ml", line 304, characters 22-40:
- 304 | let pkg_ancestors = query_requirements predlist pkg in
- ^^^^^^^^^^^^^^^^^^
- Warning 6 [labels-omitted]: label preds was omitted in the application of this function.
- File "fl_package_base.ml", line 350, characters 18-36:
- 350 | let ancestors = query_requirements predlist package_name in
- ^^^^^^^^^^^^^^^^^^
- Warning 6 [labels-omitted]: label preds was omitted in the application of this function.
- File "fl_package_base.ml", line 375, characters 23-41:
- 375 | let pkg_ancestors = query_requirements predlist pkg in
- ^^^^^^^^^^^^^^^^^^
- Warning 6 [labels-omitted]: label preds was omitted in the application of this function.
- File "fl_package_base.ml", line 510, characters 16-35:
- 510 | ( let c = package_definitions search_path pkg.package_name in
- ^^^^^^^^^^^^^^^^^^^
- Warning 6 [labels-omitted]: label search_path was omitted in the application of this function.
- ocamlopt -I +compiler-libs -g -opaque -I +unix -I +dynlink -c findlib.ml
- File "findlib.ml", line 390, characters 2-26:
- 390 | Fl_package_base.requires predlist pkg
- ^^^^^^^^^^^^^^^^^^^^^^^^
- Warning 6 [labels-omitted]: label preds was omitted in the application of this function.
- File "findlib.ml", line 396, characters 2-33:
- 396 | Fl_package_base.requires_deeply predlist pkglist
- ^^^^^^^^^^^^^^^^^^^^^^^^^^^^^^^
- Warning 6 [labels-omitted]: label preds was omitted in the application of this function.
- ocamlopt -I +compiler-libs -g -opaque -I +unix -I +dynlink -c fl_args.ml
- ocamlopt -I +compiler-libs -g -opaque -I +unix -I +dynlink -c fl_lint.ml
- ocamlopt -I +compiler-libs -g -a -o findlib.cmxa findlib_config.cmx fl_split.cmx fl_metatoken.cmx fl_meta.cmx fl_metascanner.cmx fl_topo.cmx fl_package_base.cmx findlib.cmx fl_args.cmx fl_lint.cmx
- if [ 1 -gt 0 ]; then \
- ocamlopt -I +compiler-libs -g -shared -o findlib.cmxs findlib_config.cmx fl_split.cmx fl_metatoken.cmx fl_meta.cmx fl_metascanner.cmx fl_topo.cmx fl_package_base.cmx findlib.cmx fl_args.cmx fl_lint.cmx; \
- fi
- ocamlopt -I +compiler-libs -g -opaque -I +unix -I +dynlink -c ocaml_args.ml
- ocamlopt -I +compiler-libs -g -opaque -I +unix -I +dynlink -c frontend.ml
- File "frontend.ml", line 859, characters 10-39:
- 859 | Fl_package_base.package_users predicates1 packages1
- ^^^^^^^^^^^^^^^^^^^^^^^^^^^^^
- Warning 6 [labels-omitted]: label preds was omitted in the application of this function.
- ocamlopt -I +compiler-libs -g -o ocamlfind_opt findlib.cmxa unix.cmxa \
- -I +unix -I +dynlink ocaml_args.cmx frontend.cmx
- ocamlopt -I +compiler-libs -g -opaque -I +unix -I +dynlink -c topfind.ml
- File "topfind.ml", line 128, characters 40-63:
- 128 | match Hashtbl.find Toploop.directive_table "ppx" with
- ^^^^^^^^^^^^^^^^^^^^^^^
- Alert deprecated: Toploop.directive_table
- File "topfind.ml", line 258, characters 4-27:
- 258 | Toploop.directive_table
- ^^^^^^^^^^^^^^^^^^^^^^^
- Alert deprecated: Toploop.directive_table
- File "topfind.ml", line 268, characters 4-27:
- 268 | Toploop.directive_table
- ^^^^^^^^^^^^^^^^^^^^^^^
- Alert deprecated: Toploop.directive_table
- File "topfind.ml", line 280, characters 4-27:
- 280 | Toploop.directive_table
- ^^^^^^^^^^^^^^^^^^^^^^^
- Alert deprecated: Toploop.directive_table
- File "topfind.ml", line 293, characters 4-27:
- 293 | Toploop.directive_table
- ^^^^^^^^^^^^^^^^^^^^^^^
- Alert deprecated: Toploop.directive_table
- File "topfind.ml", line 307, characters 4-27:
- 307 | Toploop.directive_table
- ^^^^^^^^^^^^^^^^^^^^^^^
- Alert deprecated: Toploop.directive_table
- File "topfind.ml", line 319, characters 4-27:
- 319 | Toploop.directive_table
- ^^^^^^^^^^^^^^^^^^^^^^^
- Alert deprecated: Toploop.directive_table
- ocamlopt -I +compiler-libs -g -a -o findlib_top.cmxa topfind.cmx
- if [ 1 -gt 0 ]; then \
- ocamlopt -I +compiler-libs -g -shared -o findlib_top.cmxs topfind.cmx; \
- fi
- ocamlopt -I +compiler-libs -g -opaque -I +unix -I +dynlink -c fl_dynload.ml
- ocamlopt -I +compiler-libs -g -a -o findlib_dynload.cmxa fl_dynload.cmx
- if [ 1 -gt 0 ]; then \
- ocamlopt -I +compiler-libs -g -shared -o findlib_dynload.cmxs fl_dynload.cmx; \
- fi
- make[1]: Leaving directory '/home/opam/.opam/4.14/.opam-switch/build/ocamlfind.1.9.6/src/findlib'
-> compiled ocamlfind.1.9.6
Processing 6/16: [dune: ocaml 255]
Processing 7/16: [dune: ocaml 255] [ocamlfind: make install]
+ /home/opam/.opam/opam-init/hooks/sandbox.sh "install" "make" "install" (CWD=/home/opam/.opam/4.14/.opam-switch/build/ocamlfind.1.9.6)
- if [ "1" -eq 1 ]; then \
- for x in camlp4 dbm graphics labltk num ocamlbuild; do \
- if [ -f "/home/opam/.opam/4.14/lib/$x/META" ]; then \
- if ! grep -Fq '[distributed with Ocaml]' "//home/opam/.opam/4.14/lib/$x/META"; then \
- rm -f site-lib-src/$x/META; \
- fi; \
- fi; \
- done; \
- test -f "site-lib-src/num/META" || rm -f "site-lib-src/num-top/META"; \
- fi
- echo 'SITELIB_META =' > Makefile.packages.in
- for x in `ls site-lib-src`; do test ! -f "site-lib-src/$x/META" || echo $x >> Makefile.packages.in; done
- tr '\n' ' ' < Makefile.packages.in > Makefile.packages
- rm Makefile.packages.in
- install -d "/home/opam/.opam/4.14/bin"
- install -d "/home/opam/.opam/4.14/man"
- make install-config
- make[1]: Entering directory '/home/opam/.opam/4.14/.opam-switch/build/ocamlfind.1.9.6'
- install -d "`dirname \"/home/opam/.opam/4.14/lib/findlib.conf\"`"
- test -f "/home/opam/.opam/4.14/lib/findlib.conf" || install -c findlib.conf "/home/opam/.opam/4.14/lib/findlib.conf"
- make[1]: Leaving directory '/home/opam/.opam/4.14/.opam-switch/build/ocamlfind.1.9.6'
- for p in findlib; do ( cd src/$p; make install ); done
- make[1]: Entering directory '/home/opam/.opam/4.14/.opam-switch/build/ocamlfind.1.9.6/src/findlib'
- install -d "/home/opam/.opam/4.14/lib/findlib"
- install -d "/home/opam/.opam/4.14/bin"
- test 1 -eq 0 || install -d "/home/opam/.opam/4.14/lib/ocaml"
- test 1 -eq 0 || install -c topfind "/home/opam/.opam/4.14/lib/ocaml/"
- files=` ../../tools/collect_files ../../Makefile.config \
- findlib.cmi findlib.mli findlib.cma findlib.cmxa findlib.a findlib.cmxs \
- findlib_config.cmi findlib_config.ml topfind.cmi topfind.mli \
- fl_args.cmi fl_lint.cmi fl_meta.cmi fl_split.cmi fl_topo.cmi ocaml_args.cmi \
- fl_package_base.mli fl_package_base.cmi fl_metascanner.mli fl_metascanner.cmi \
- fl_metatoken.cmi findlib_top.cma findlib_top.cmxa findlib_top.a findlib_top.cmxs \
- findlib_dynload.cma findlib_dynload.cmxa findlib_dynload.a findlib_dynload.cmxs fl_dynload.mli fl_dynload.cmi \
- META` && \
- install -c $files "/home/opam/.opam/4.14/lib/findlib/"
- f="ocamlfind"; { test -f ocamlfind_opt && f="ocamlfind_opt"; }; \
- install -c $f "/home/opam/.opam/4.14/bin/ocamlfind"
- # the following "if" block is only needed for 4.00beta2
- if [ 1 -eq 0 -a -f "/home/opam/.opam/4.14/lib/ocaml/compiler-libs/topdirs.cmi" ]; then \
- cd "/home/opam/.opam/4.14/lib/ocaml/compiler-libs/"; \
- install -c topdirs.cmi toploop.cmi "/home/opam/.opam/4.14/lib/findlib/"; \
- fi
- make[1]: Leaving directory '/home/opam/.opam/4.14/.opam-switch/build/ocamlfind.1.9.6/src/findlib'
- make install-meta
- make[1]: Entering directory '/home/opam/.opam/4.14/.opam-switch/build/ocamlfind.1.9.6'
- for x in bigarray bytes compiler-libs dynlink ocamldoc stdlib str threads unix ; do install -d "/home/opam/.opam/4.14/lib/$x"; install -c site-lib-src/$x/META "/home/opam/.opam/4.14/lib/$x/META.tmp" && mv "/home/opam/.opam/4.14/lib/$x/META.tmp" "/home/opam/.opam/4.14/lib/$x/META"; done
- install -d "/home/opam/.opam/4.14/lib/findlib"; install -c Makefile.packages "/home/opam/.opam/4.14/lib/findlib/Makefile.packages"
- make[1]: Leaving directory '/home/opam/.opam/4.14/.opam-switch/build/ocamlfind.1.9.6'
- test ! -f 'site-lib-src/num-top/META' || { cd src/findlib; make install-num-top; }
- test ! -f 'site-lib-src/camlp4/META' || install -c tools/safe_camlp4 "/home/opam/.opam/4.14/bin"
- make install-doc
- make[1]: Entering directory '/home/opam/.opam/4.14/.opam-switch/build/ocamlfind.1.9.6'
- install -d "/home/opam/.opam/4.14/man/man1" "/home/opam/.opam/4.14/man/man3" "/home/opam/.opam/4.14/man/man5"
- install -c doc/ref-man/ocamlfind.1 "/home/opam/.opam/4.14/man/man1"
- install -c doc/ref-man/META.5 doc/ref-man/site-lib.5 doc/ref-man/findlib.conf.5 "/home/opam/.opam/4.14/man/man5"
- make[1]: Leaving directory '/home/opam/.opam/4.14/.opam-switch/build/ocamlfind.1.9.6'
-> installed ocamlfind.1.9.6
Processing 7/16: [dune: ocaml 255]
+ /home/opam/.opam/opam-init/hooks/sandbox.sh "build" "ocaml" "boot/bootstrap.ml" "-j" "255" (CWD=/home/opam/.opam/4.14/.opam-switch/build/dune.3.12.1)
- ocamlc -output-complete-exe -w -24 -g -o .duneboot.exe -I boot unix.cma boot/libs.ml boot/duneboot.ml
- ./.duneboot.exe -j 255
- cd _boot && /home/opam/.opam/4.14/bin/ocamlopt.opt -c -g -no-alias-deps -w -49-6 -alert -unstable -I +threads opamLocal.ml
- File "vendor/opam/src/repository/opamLocal.ml", lines 109-114, characters 46-34:
- Warning 8 [partial-match]: this pattern-matching is not exhaustive.
- Here is an example of a case that is not matched:
- Checksum_mismatch _
- File "vendor/opam/src/repository/opamLocal.ml", lines 170-189, characters 44-56:
- Warning 8 [partial-match]: this pattern-matching is not exhaustive.
- Here is an example of a case that is not matched:
- Checksum_mismatch _
- File "vendor/opam/src/repository/opamLocal.ml", lines 209-231, characters 8-44:
- Warning 8 [partial-match]: this pattern-matching is not exhaustive.
- Here is an example of a case that is not matched:
- Checksum_mismatch _
- cd _boot && /home/opam/.opam/4.14/bin/ocamlopt.opt -c -g -no-alias-deps -w -49-6 -alert -unstable -I +threads opamVCS.ml
- File "vendor/opam/src/repository/opamVCS.ml", lines 179-182, characters 11-40:
- Warning 8 [partial-match]: this pattern-matching is not exhaustive.
- Here is an example of a case that is not matched:
- Checksum_mismatch _
- cd _boot && /home/opam/.opam/4.14/bin/ocamlopt.opt -c -g -no-alias-deps -w -49-6 -alert -unstable -I +threads opamDownload.ml
- File "vendor/opam/src/repository/opamDownload.ml", lines 323-361, characters 42-41:
- Warning 8 [partial-match]: this pattern-matching is not exhaustive.
- Here is an example of a case that is not matched:
- Checksum_mismatch _
- cd _boot && /home/opam/.opam/4.14/bin/ocamlopt.opt -c -g -no-alias-deps -w -49-6 -alert -unstable -I +threads opamRepository.ml
- File "vendor/opam/src/repository/opamRepository.ml", lines 88-90, characters 45-77:
- Warning 8 [partial-match]: this pattern-matching is not exhaustive.
- Here is an example of a case that is not matched:
- Checksum_mismatch _
- File "vendor/opam/src/repository/opamRepository.ml", lines 277-281, characters 38-17:
- Warning 8 [partial-match]: this pattern-matching is not exhaustive.
- Here is an example of a case that is not matched:
- Checksum_mismatch _
- File "vendor/opam/src/repository/opamRepository.ml", lines 423-427, characters 12-42:
- Warning 8 [partial-match]: this pattern-matching is not exhaustive.
- Here is an example of a case that is not matched:
- (_, Checksum_mismatch _)
-
Processing 7/16: [dune: ./_boot/dune.exe build]
+ /home/opam/.opam/opam-init/hooks/sandbox.sh "build" "./_boot/dune.exe" "build" "dune.install" "--release" "--profile" "dune-bootstrap" "-j" "255" (CWD=/home/opam/.opam/4.14/.opam-switch/build/dune.3.12.1)
-> compiled dune.3.12.1
-> installed dune.3.12.1
Processing 9/16: [menhirLib: dune build]
Processing 10/16: [menhirLib: dune build] [menhirSdk: dune build]
+ /home/opam/.opam/opam-init/hooks/sandbox.sh "build" "dune" "build" "-p" "menhirSdk" "-j" "255" (CWD=/home/opam/.opam/4.14/.opam-switch/build/menhirSdk.20211128)
-> compiled menhirSdk.20211128
Processing 10/16: [menhirLib: dune build]
-> installed menhirSdk.20211128
Processing 11/16: [menhirLib: dune build]
+ /home/opam/.opam/opam-init/hooks/sandbox.sh "build" "dune" "build" "-p" "menhirLib" "-j" "255" (CWD=/home/opam/.opam/4.14/.opam-switch/build/menhirLib.20211128)
- (cd _build/default/lib/pack && ./pack.exe)
- Creating menhirLib.ml...
- Creating menhirLib.mli...
-> compiled menhirLib.20211128
-> installed menhirLib.20211128
Processing 13/16: [menhir: dune build]
+ /home/opam/.opam/opam-init/hooks/sandbox.sh "build" "dune" "build" "-p" "menhir" "-j" "255" (CWD=/home/opam/.opam/4.14/.opam-switch/build/menhir.20211128)
- (cd _build/default/src/stage2 && .bin/menhir --no-pager --table --fixed-exception --require-aliases --strict parser.mly --compare-errors parserMessages.auto.messages --compare-errors parserMessages.messages) > _build/default/src/stage2/parserMessages.check
- Read 101 sample input sentences and 101 error messages.
- Read 101 sample input sentences and 48 error messages.
- (cd _build/default && src/stage2/.bin/menhir --no-pager --table --fixed-exception --require-aliases --strict --strict -lg 1 -la 1 -lc 1 -v src/stage2/parser.mly --base src/stage2/parser --infer-read-reply src/stage2/parser__mock.mli.inferred)
- Grammar has 56 nonterminal symbols, among which 1 start symbols.
- Grammar has 37 terminal symbols.
- Grammar has 129 productions.
- Built an LR(0) automaton with 194 states.
- The grammar is not SLR(1) -- 5 states have a conflict.
- The construction mode is no-pager.
- Built an LR(1) automaton with 298 states.
- One shift/reduce conflict was silently solved.
- Extra reductions on error were added in 40 states.
- Priority played a role in 0 of these states.
- 152 out of 298 states have a default reduction.
- The action table is 11324 entries; 1610 non-zero; 1359 compressed.
- The action table occupies roughly 2816 bytes.
- The goto table is 16986 entries; 329 non-zero; 636 compressed.
- The goto table occupies roughly 1368 bytes.
- The error table occupies roughly 1448 bytes.
- The default_reduction table occupies roughly 336 bytes.
- The lhs table occupies roughly 168 bytes.
- The trace table occupies roughly 8 bytes.
- (cd _build/default/src/stage2 && .bin/menhir --no-pager --table --fixed-exception --require-aliases --strict parser.mly --compile-errors parserMessages.messages) > _build/default/src/stage2/parserMessages.ml
- Read 101 sample input sentences and 48 error messages.
-> compiled menhir.20211128
-> installed menhir.20211128
Processing 15/16: [ollvm: ./configure]
+ /home/opam/.opam/opam-init/hooks/sandbox.sh "build" "./configure" (CWD=/home/opam/.opam/4.14/.opam-switch/build/ollvm.0.99)
- checking for a BSD-compatible install... /usr/bin/install -c
- checking whether build environment is sane... yes
- checking for a thread-safe mkdir -p... /usr/bin/mkdir -p
- checking for gawk... no
- checking for mawk... mawk
- checking whether make sets $(MAKE)... yes
- checking whether make supports nested variables... yes
- checking whether to enable maintainer-specific portions of Makefiles... yes
- checking for gcc... gcc
- checking whether the C compiler works... yes
- checking for C compiler default output file name... a.out
- checking for suffix of executables...
- checking whether we are cross compiling... no
- checking for suffix of object files... o
- checking whether we are using the GNU C compiler... yes
- checking whether gcc accepts -g... yes
- checking for gcc option to accept ISO C89... none needed
- checking whether gcc understands -c and -o together... yes
- checking for style of include used by make... GNU
- checking dependency style of gcc... none
- checking for ocamlc... ocamlc
- OCaml version is 4.14.1
- OCaml library path is /home/opam/.opam/4.14/lib/ocaml
- checking for ocamlopt... ocamlopt
- checking for ocamlc.opt... ocamlc.opt
- checking for ocamlopt.opt... ocamlopt.opt
- checking for dynlink.cmxa... yes
- checking for ocaml... ocaml
- checking for ocamldep... ocamldep
- checking for ocamlmktop... ocamlmktop
- checking for ocamlmklib... ocamlmklib
- checking for ocamldoc... ocamldoc
- checking for ocamlbuild... no
- checking for ocamlfind... ocamlfind
- checking for ocamllex... ocamllex
- checking for ocamllex.opt... ocamllex.opt
- checking for menhir... menhir
- checking for OCaml findlib package llvm... not found
- configure: WARNING: Llvmgateway module will not be installed.
- checking that generated files are newer than configure...
- done
- configure: creating ./config.status
- config.status: creating Makefile
- config.status: creating src/Makefile.common
- config.status: executing depfiles commands
Processing 15/16: [ollvm: make]
+ /home/opam/.opam/opam-init/hooks/sandbox.sh "build" "make" (CWD=/home/opam/.opam/4.14/.opam-switch/build/ollvm.0.99)
- cd . && /bin/bash /home/opam/.opam/4.14/.opam-switch/build/ollvm.0.99/missing automake-1.14 --gnu
- /home/opam/.opam/4.14/.opam-switch/build/ollvm.0.99/missing: line 81: automake-1.14: command not found
- WARNING: 'automake-1.14' is missing on your system.
- You should only need it if you modified 'Makefile.am' or
- 'configure.ac' or m4 files included by 'configure.ac'.
- The 'automake' program is part of the GNU Automake package:
- <http://www.gnu.org/software/automake>
- It also requires GNU Autoconf, GNU m4 and Perl in order to run:
- <http://www.gnu.org/software/autoconf>
- <http://www.gnu.org/software/m4/>
- <http://www.perl.org/>
- make: *** [Makefile:241: Makefile.in] Error 1
[ERROR] The compilation of ollvm.0.99 failed at "make".
#=== ERROR while compiling ollvm.0.99 =========================================#
# context 2.2.0~alpha4~dev | linux/x86_64 | ocaml-base-compiler.4.14.1 | file:///home/opam/opam-repository
# path ~/.opam/4.14/.opam-switch/build/ollvm.0.99
# command ~/.opam/opam-init/hooks/sandbox.sh build make
# exit-code 2
# env-file ~/.opam/log/ollvm-8-264b0d.env
# output-file ~/.opam/log/ollvm-8-264b0d.out
### output ###
# cd . && /bin/bash /home/opam/.opam/4.14/.opam-switch/build/ollvm.0.99/missing automake-1.14 --gnu
# /home/opam/.opam/4.14/.opam-switch/build/ollvm.0.99/missing: line 81: automake-1.14: command not found
# WARNING: 'automake-1.14' is missing on your system.
# You should only need it if you modified 'Makefile.am' or
# 'configure.ac' or m4 files included by 'configure.ac'.
# The 'automake' program is part of the GNU Automake package:
# <http://www.gnu.org/software/automake>
# It also requires GNU Autoconf, GNU m4 and Perl in order to run:
# <http://www.gnu.org/software/autoconf>
# <http://www.gnu.org/software/m4/>
# <http://www.perl.org/>
# make: *** [Makefile:241: Makefile.in] Error 1
<><> Error report <><><><><><><><><><><><><><><><><><><><><><><><><><><><><><><>
+- The following actions failed
| - build ollvm 0.99
+-
+- The following changes have been performed
| - install dune 3.12.1
| - install menhir 20211128
| - install menhirLib 20211128
| - install menhirSdk 20211128
| - install ocamlfind 1.9.6
+-
# Run eval $(opam env) to update the current shell environment
The former state can be restored with:
/usr/bin/opam switch import "/home/opam/.opam/4.14/.opam-switch/backup/state-20231228084512.export"
'opam install -vy ollvm.0.99' failed.
"/usr/bin/env" "bash" "-c" "
opam remove -y "ollvm.0.99"
opam install -vy "ollvm.0.99"
res=$?
if [ $res = 31 ]; then
if opam show -f x-ci-accept-failures: "ollvm.0.99" | grep -q '"debian-unstable"'; then
echo "This package failed and has been disabled for CI using the 'x-ci-accept-failures' field."
exit 69
fi
fi
exit $res
" failed with exit status 31
Failed: Build failed