OCamllabs icon Home|Differences with the last checks|Previous runs


Building on toxis.caelum.ci.dev

(from ocaml/opam:debian-unstable)
2024-02-07 14:25.41 ---> using "0acd5aeaa8f7bc314514d9795d14a7f12ec72a6a5b11c5904350189734c6859b" from cache

/: (user (uid 1000) (gid 1000))

/: (env OPAMPRECISETRACKING 1)

/: (env OPAMUTF8 never)

/: (env OPAMEXTERNALSOLVER builtin-0install)

/: (env OPAMCRITERIA +removed)

/: (run (shell "sudo ln -f /usr/bin/opam-dev /usr/bin/opam"))
2024-02-07 14:25.41 ---> using "65c3237f501f7c75f3828458ecf2342bc41c98aaef8c6a7fd82bf46a58cb258c" from cache

/: (run (network host)
        (shell "rm -rf ~/opam-repository && git clone -q 'https://github.com/ocaml/opam-repository' ~/opam-repository && git -C ~/opam-repository checkout -q e587a9437d8bb41f7c0fda20b186c5c0d5178307"))
2024-02-07 14:25.41 ---> using "ba4ab7a29ffbb7242a0f4a23f5d47ab4641ccdfb0e44130f467a231865081ad1" from cache

/: (run (shell "rm -rf ~/.opam && opam init -ya --bare --config ~/.opamrc-sandbox ~/opam-repository"))
Configuring from /home/opam/.opamrc-sandbox, then /home/opam/.opamrc, and finally from built-in defaults.
Checking for available remotes: rsync and local, git.
  - you won't be able to use mercurial repositories unless you install the hg command on your system.
  - you won't be able to use darcs repositories unless you install the darcs command on your system.


<><> Fetching repository information ><><><><><><><><><><><><><><><><><><><><><>
[default] Initialised

User configuration:
  ~/.profile is already up-to-date.
[NOTE] Make sure that ~/.profile is well sourced in your ~/.bashrc.

2024-02-07 14:25.41 ---> using "3ee1eaa848e0a3884e82cc07c535ab5dc8f986c3607c006421763988fa5c48fb" from cache

/: (run (cache (opam-archives (target /home/opam/.opam/download-cache)))
        (network host)
        (shell "opam switch create --repositories=default '4.11' '4.11.2'"))

<><> Installing new switch packages <><><><><><><><><><><><><><><><><><><><><><>
Switch invariant: ["ocaml-base-compiler" {= "4.11.2"} | "ocaml-system" {= "4.11.2"}]

<><> Processing actions <><><><><><><><><><><><><><><><><><><><><><><><><><><><>
-> installed base-bigarray.base
-> installed base-threads.base
-> installed base-unix.base
-> retrieved ocaml-base-compiler.4.11.2  (cached)
-> installed ocaml-base-compiler.4.11.2
-> installed ocaml-config.1
-> installed ocaml.4.11.2
Done.
# Run eval $(opam env --switch=4.11) to update the current shell environment
2024-02-07 14:25.41 ---> using "63ffc4301e26bd7f5e0211e7aeeef6bd9a7622489ac96f6e379f7d79359dad41" from cache

/: (run (network host)
        (shell "opam update --depexts"))
+ /usr/bin/sudo "apt-get" "update"
- Get:1 http://deb.debian.org/debian unstable InRelease [198 kB]
- Get:2 http://deb.debian.org/debian unstable/main amd64 Packages.diff/Index [63.6 kB]
- Ign:2 http://deb.debian.org/debian unstable/main amd64 Packages.diff/Index
- Get:3 http://deb.debian.org/debian unstable/main amd64 Packages [9717 kB]
- Fetched 9979 kB in 2s (4974 kB/s)
- Reading package lists...
- 
2024-02-07 14:25.41 ---> using "f909c6f3b47bb1aed35629626270aa4c442f30e2cc45a9ea5edf7177d08ffa32" from cache

/: (run (cache (opam-archives (target /home/opam/.opam/download-cache)))
        (network host)
        (shell  "\
               \nopam remove -y \"conf-dbm.1.0.0\"\
               \nopam install -vy \"conf-dbm.1.0.0\"\
               \nres=$?\
               \nif [ $res = 31 ]; then\
               \n    if opam show -f x-ci-accept-failures: \"conf-dbm.1.0.0\" | grep -q '\"debian-unstable\"'; then\
               \n        echo \"This package failed and has been disabled for CI using the 'x-ci-accept-failures' field.\"\
               \n        exit 69\
               \n    fi\
               \nfi\
               \n\
               \n\
               \nexit $res\
               \n"))
[NOTE] conf-dbm.1.0.0 is not installed.

Nothing to do.
The following actions will be performed:
=== install 1 package
  - install conf-dbm 1.0.0

The following system packages will first need to be installed:
    libgdbm-dev

<><> Handling external dependencies <><><><><><><><><><><><><><><><><><><><><><>

opam believes some required external dependencies are missing. opam can:
> 1. Run apt-get to install them (may need root/sudo access)
  2. Display the recommended apt-get command and wait while you run it manually (e.g. in another terminal)
  3. Continue anyway, and, upon success, permanently register that this external dependency is present, but not detectable
  4. Abort the installation

[1/2/3/4] 1

+ /usr/bin/sudo "apt-get" "install" "-qq" "-yy" "libgdbm-dev"
- debconf: delaying package configuration, since apt-utils is not installed
- Selecting previously unselected package libgdbm-dev:amd64.
- (Reading database ... 
(Reading database ... 5%
(Reading database ... 10%
(Reading database ... 15%
(Reading database ... 20%
(Reading database ... 25%
(Reading database ... 30%
(Reading database ... 35%
(Reading database ... 40%
(Reading database ... 45%
(Reading database ... 50%
(Reading database ... 55%
(Reading database ... 60%
(Reading database ... 65%
(Reading database ... 70%
(Reading database ... 75%
(Reading database ... 80%
(Reading database ... 85%
(Reading database ... 90%
(Reading database ... 95%
(Reading database ... 100%
(Reading database ... 19823 files and directories currently installed.)
- Preparing to unpack .../libgdbm-dev_1.23-5_amd64.deb ...
- Unpacking libgdbm-dev:amd64 (1.23-5) ...
- Setting up libgdbm-dev:amd64 (1.23-5) ...

<><> Processing actions <><><><><><><><><><><><><><><><><><><><><><><><><><><><>
Processing  2/3: [conf-dbm: sh]
+ /home/opam/.opam/opam-init/hooks/sandbox.sh "build" "sh" "-c" "cc test_gdbm.c -I/usr/include -I/usr/local/include -I/usr/include/db1 -I/usr/include/gdbm || cc test_gdbm.c -I/usr/include -I/usr/local/include -I/usr/include/db1 -I/usr/include/gdbm -lndbm || cc test_gdbm.c -I/usr/include -I/usr/local/include -I/usr/include/db1 -I/usr/include/gdbm -ldb1 || cc test_gdbm.c -I/usr/include -I/usr/local/include -I/usr/include/db1 -I/usr/include/gdbm -lgdbm || cc test_gdbm.c -I/usr/include -I/usr/local/include -I/usr/include/db1 -I/usr/include/gdbm -lgdbm_compat -lgdbm || cc test_ndbm.c -v -I/usr/include -I/usr/local/include || cc test_ndbm.c -v -I/usr/include -I/usr/local/include -ldb || cc test_ndbm.c -v -I/usr/include -I/usr/local/include -lndbm" (CWD=/home/opam/.opam/4.11/.opam-switch/build/conf-dbm.1.0.0)
- /usr/bin/ld: /opam-tmp/ccjOPDy4.o: in function `main':
- test_gdbm.c:(.text+0x28): undefined reference to `gdbm_open'
- /usr/bin/ld: test_gdbm.c:(.text+0x38): undefined reference to `gdbm_close'
- collect2: error: ld returned 1 exit status
- /usr/bin/ld: cannot find -lndbm: No such file or directory
- collect2: error: ld returned 1 exit status
- /usr/bin/ld: cannot find -ldb1: No such file or directory
- collect2: error: ld returned 1 exit status
-> compiled  conf-dbm.1.0.0
-> installed conf-dbm.1.0.0
Done.
# Run eval $(opam env) to update the current shell environment
2024-02-07 14:25.55 ---> saved as "fbeaf8d5b1bea617ec835d617c535cff14d9112342db62ea243066ccb6f25f48"
Job succeeded