OCamllabs icon Home|Differences with the last checks|Previous runs


Building on asteria.caelum.ci.dev

(from ocaml/opam:debian-unstable)
Unable to find image 'ocaml/opam:debian-unstable' locally
debian-unstable: Pulling from ocaml/opam
Digest: sha256:f95f89879cdedf718c3bc0bd75279248897ab332e434605f8ab0f32b62fd9ab4
Status: Downloaded newer image for ocaml/opam:debian-unstable
2024-02-07 10:53.31 ---> using "0acd5aeaa8f7bc314514d9795d14a7f12ec72a6a5b11c5904350189734c6859b" from cache

/: (user (uid 1000) (gid 1000))

/: (env OPAMPRECISETRACKING 1)

/: (env OPAMUTF8 never)

/: (env OPAMEXTERNALSOLVER builtin-0install)

/: (env OPAMCRITERIA +removed)

/: (run (shell "sudo ln -f /usr/bin/opam-dev /usr/bin/opam"))
2024-02-07 10:53.31 ---> using "65c3237f501f7c75f3828458ecf2342bc41c98aaef8c6a7fd82bf46a58cb258c" from cache

/: (run (network host)
        (shell "rm -rf ~/opam-repository && git clone -q 'https://github.com/ocaml/opam-repository' ~/opam-repository && git -C ~/opam-repository checkout -q e587a9437d8bb41f7c0fda20b186c5c0d5178307"))
2024-02-07 10:53.31 ---> using "ba4ab7a29ffbb7242a0f4a23f5d47ab4641ccdfb0e44130f467a231865081ad1" from cache

/: (run (shell "rm -rf ~/.opam && opam init -ya --bare --config ~/.opamrc-sandbox ~/opam-repository"))
Configuring from /home/opam/.opamrc-sandbox, then /home/opam/.opamrc, and finally from built-in defaults.
Checking for available remotes: rsync and local, git.
  - you won't be able to use mercurial repositories unless you install the hg command on your system.
  - you won't be able to use darcs repositories unless you install the darcs command on your system.


<><> Fetching repository information ><><><><><><><><><><><><><><><><><><><><><>
[default] Initialised

User configuration:
  ~/.profile is already up-to-date.
[NOTE] Make sure that ~/.profile is well sourced in your ~/.bashrc.

2024-02-07 10:53.31 ---> using "3ee1eaa848e0a3884e82cc07c535ab5dc8f986c3607c006421763988fa5c48fb" from cache

/: (run (cache (opam-archives (target /home/opam/.opam/download-cache)))
        (network host)
        (shell "opam switch create --repositories=default '4.12' '4.12.1'"))

<><> Installing new switch packages <><><><><><><><><><><><><><><><><><><><><><>
Switch invariant: ["ocaml-base-compiler" {= "4.12.1"} | "ocaml-system" {= "4.12.1"}]

<><> Processing actions <><><><><><><><><><><><><><><><><><><><><><><><><><><><>
-> installed base-bigarray.base
-> installed base-threads.base
-> installed base-unix.base
-> installed ocaml-options-vanilla.1
-> retrieved ocaml-base-compiler.4.12.1  (cached)
-> installed ocaml-base-compiler.4.12.1
-> installed ocaml-config.2
-> installed ocaml.4.12.1
Done.
# Run eval $(opam env --switch=4.12) to update the current shell environment
2024-02-07 10:53.31 ---> using "91bc92e27bccad5f71e8764c46b0dc875e81a4f8c5da75c2f63f800b3116f29b" from cache

/: (run (network host)
        (shell "opam update --depexts"))
+ /usr/bin/sudo "apt-get" "update"
- Get:1 http://deb.debian.org/debian unstable InRelease [198 kB]
- Get:2 http://deb.debian.org/debian unstable/main amd64 Packages.diff/Index [63.6 kB]
- Get:3 http://deb.debian.org/debian unstable/main amd64 Packages T-2024-02-07-0807.59-F-2024-02-02-1408.05.pdiff [256 kB]
- Get:3 http://deb.debian.org/debian unstable/main amd64 Packages T-2024-02-07-0807.59-F-2024-02-02-1408.05.pdiff [256 kB]
- Fetched 518 kB in 1s (358 kB/s)
- Reading package lists...
- 
2024-02-07 10:53.31 ---> using "eda461848f8792ccb06f274e8549bc942efa4d67002b078a1a0b8795adaff3ee" from cache

/: (run (cache (opam-archives (target /home/opam/.opam/download-cache)))
        (network host)
        (shell  "\
               \nopam remove -y \"arb.0.3.2\"\
               \nopam install -vy \"arb.0.3.2\"\
               \nres=$?\
               \nif [ $res = 31 ]; then\
               \n    if opam show -f x-ci-accept-failures: \"arb.0.3.2\" | grep -q '\"debian-unstable\"'; then\
               \n        echo \"This package failed and has been disabled for CI using the 'x-ci-accept-failures' field.\"\
               \n        exit 69\
               \n    fi\
               \nfi\
               \n\
               \n\
               \nexit $res\
               \n"))
[NOTE] arb.0.3.2 is not installed.

Nothing to do.
The following actions will be performed:
=== install 16 packages
  - install arb               0.3.2
  - install bigarray-compat   1.1.0  [required by ctypes]
  - install conf-arb          1      [required by arb]
  - install conf-flint        1      [required by flint]
  - install conf-gmp          4      [required by conf-mpfr]
  - install conf-mpfr         3      [required by arb]
  - install conf-pkg-config   3      [required by arb]
  - install csexp             1.5.2  [required by dune-configurator]
  - install ctypes            0.21.1 [required by arb]
  - install dune              3.13.1 [required by arb]
  - install dune-configurator 3.13.1 [required by arb]
  - install flint             0.3.2  [required by arb]
  - install integers          0.7.0  [required by ctypes]
  - install ocamlfind         1.9.6  [required by zarith]
  - install stdlib-shims      0.3.0  [required by integers]
  - install zarith            1.13   [required by flint]

The following system packages will first need to be installed:
    libflint-arb-dev libflint-dev libgmp-dev libmpfr-dev pkg-config

<><> Handling external dependencies <><><><><><><><><><><><><><><><><><><><><><>

opam believes some required external dependencies are missing. opam can:
> 1. Run apt-get to install them (may need root/sudo access)
  2. Display the recommended apt-get command and wait while you run it manually (e.g. in another terminal)
  3. Continue anyway, and, upon success, permanently register that this external dependency is present, but not detectable
  4. Abort the installation

[1/2/3/4] 1

+ /usr/bin/sudo "apt-get" "install" "-qq" "-yy" "libflint-arb-dev" "libflint-dev" "libgmp-dev" "libmpfr-dev" "pkg-config"
- debconf: delaying package configuration, since apt-utils is not installed
- Selecting previously unselected package libgf2x3:amd64.
- (Reading database ... 
(Reading database ... 5%
(Reading database ... 10%
(Reading database ... 15%
(Reading database ... 20%
(Reading database ... 25%
(Reading database ... 30%
(Reading database ... 35%
(Reading database ... 40%
(Reading database ... 45%
(Reading database ... 50%
(Reading database ... 55%
(Reading database ... 60%
(Reading database ... 65%
(Reading database ... 70%
(Reading database ... 75%
(Reading database ... 80%
(Reading database ... 85%
(Reading database ... 90%
(Reading database ... 95%
(Reading database ... 100%
(Reading database ... 19832 files and directories currently installed.)
- Preparing to unpack .../00-libgf2x3_1.3.0-2_amd64.deb ...
- Unpacking libgf2x3:amd64 (1.3.0-2) ...
- Selecting previously unselected package libntl44:amd64.
- Preparing to unpack .../01-libntl44_11.5.1-1+b2_amd64.deb ...
- Unpacking libntl44:amd64 (11.5.1-1+b2) ...
- Selecting previously unselected package libflint17:amd64.
- Preparing to unpack .../02-libflint17_2.9.0-5_amd64.deb ...
- Unpacking libflint17:amd64 (2.9.0-5) ...
- Selecting previously unselected package libflint-arb2:amd64.
- Preparing to unpack .../03-libflint-arb2_1%3a2.23.0-1+b1_amd64.deb ...
- Unpacking libflint-arb2:amd64 (1:2.23.0-1+b1) ...
- Selecting previously unselected package libflint18:amd64.
- Preparing to unpack .../04-libflint18_3.0.1-2_amd64.deb ...
- Unpacking libflint18:amd64 (3.0.1-2) ...
- Selecting previously unselected package libgmpxx4ldbl:amd64.
- Preparing to unpack .../05-libgmpxx4ldbl_2%3a6.3.0+dfsg-2_amd64.deb ...
- Unpacking libgmpxx4ldbl:amd64 (2:6.3.0+dfsg-2) ...
- Selecting previously unselected package libgmp-dev:amd64.
- Preparing to unpack .../06-libgmp-dev_2%3a6.3.0+dfsg-2_amd64.deb ...
- Unpacking libgmp-dev:amd64 (2:6.3.0+dfsg-2) ...
- Selecting previously unselected package libmpfr-dev:amd64.
- Preparing to unpack .../07-libmpfr-dev_4.2.1-1_amd64.deb ...
- Unpacking libmpfr-dev:amd64 (4.2.1-1) ...
- Selecting previously unselected package libflint-dev.
- Preparing to unpack .../08-libflint-dev_3.0.1-2_amd64.deb ...
- Unpacking libflint-dev (3.0.1-2) ...
- Selecting previously unselected package libflint-arb-dev:amd64.
- Preparing to unpack .../09-libflint-arb-dev_1%3a2.23.0-1+b1_amd64.deb ...
- Unpacking libflint-arb-dev:amd64 (1:2.23.0-1+b1) ...
- Selecting previously unselected package libpkgconf3:amd64.
- Preparing to unpack .../10-libpkgconf3_1.8.1-1+b2_amd64.deb ...
- Unpacking libpkgconf3:amd64 (1.8.1-1+b2) ...
- Selecting previously unselected package pkgconf-bin.
- Preparing to unpack .../11-pkgconf-bin_1.8.1-1+b2_amd64.deb ...
- Unpacking pkgconf-bin (1.8.1-1+b2) ...
- Selecting previously unselected package pkgconf:amd64.
- Preparing to unpack .../12-pkgconf_1.8.1-1+b2_amd64.deb ...
- Unpacking pkgconf:amd64 (1.8.1-1+b2) ...
- Selecting previously unselected package pkg-config:amd64.
- Preparing to unpack .../13-pkg-config_1.8.1-1+b2_amd64.deb ...
- Unpacking pkg-config:amd64 (1.8.1-1+b2) ...
- Setting up libgf2x3:amd64 (1.3.0-2) ...
- Setting up libpkgconf3:amd64 (1.8.1-1+b2) ...
- Setting up libgmpxx4ldbl:amd64 (2:6.3.0+dfsg-2) ...
- Setting up libflint18:amd64 (3.0.1-2) ...
- Setting up pkgconf-bin (1.8.1-1+b2) ...
- Setting up libntl44:amd64 (11.5.1-1+b2) ...
- Setting up libgmp-dev:amd64 (2:6.3.0+dfsg-2) ...
- Setting up libflint17:amd64 (2.9.0-5) ...
- Setting up libmpfr-dev:amd64 (4.2.1-1) ...
- Setting up pkgconf:amd64 (1.8.1-1+b2) ...
- Setting up pkg-config:amd64 (1.8.1-1+b2) ...
- Setting up libflint-arb2:amd64 (1:2.23.0-1+b1) ...
- Setting up libflint-dev (3.0.1-2) ...
- Setting up libflint-arb-dev:amd64 (1:2.23.0-1+b1) ...
- Processing triggers for libc-bin (2.37-15) ...

<><> Processing actions <><><><><><><><><><><><><><><><><><><><><><><><><><><><>
Processing  1/46:
Processing  2/46:
Processing  3/46:
Processing  4/46:
Processing  5/46:
Processing  6/46:
Processing  7/46:
Processing  8/46:
Processing  9/46: [conf-arb: sh echo "#include  \"arb.h\"" > test.c]
Processing 10/46: [conf-arb: sh echo "#include  \"arb.h\"" > test.c] [conf-flint: sh]
Processing 11/46: [conf-arb: sh echo "#include  \"arb.h\"" > test.c] [conf-flint: sh] [conf-gmp: sh]
Processing 12/46: [conf-arb: sh echo "#include  \"arb.h\"" > test.c] [conf-flint: sh] [conf-gmp: sh] [conf-pkg-config: pkg-config]
-> retrieved arb.0.3.2, flint.0.3.2  (cached)
Processing 13/46: [conf-arb: sh echo "#include  \"arb.h\"" > test.c] [conf-flint: sh] [conf-gmp: sh] [conf-pkg-config: pkg-config]
-> retrieved bigarray-compat.1.1.0  (cached)
Processing 14/46: [conf-arb: sh echo "#include  \"arb.h\"" > test.c] [conf-flint: sh] [conf-gmp: sh] [conf-pkg-config: pkg-config]
-> retrieved csexp.1.5.2  (cached)
Processing 15/46: [conf-arb: sh echo "#include  \"arb.h\"" > test.c] [conf-flint: sh] [conf-gmp: sh] [conf-pkg-config: pkg-config]
+ /home/opam/.opam/opam-init/hooks/sandbox.sh "build" "sh" "-exc" "echo \"#include  \\\"arb.h\\\"\" > test.c" (CWD=/home/opam/.opam/4.12/.opam-switch/build/conf-arb.1)
- + echo #include  "arb.h"
Processing 15/46: [conf-arb: sh] [conf-flint: sh] [conf-gmp: sh] [conf-pkg-config: pkg-config]
+ /home/opam/.opam/opam-init/hooks/sandbox.sh "build" "sh" "-exc" "echo \"#include  \\\"flint/fmpz_poly.h\\\"\" > test.c" (CWD=/home/opam/.opam/4.12/.opam-switch/build/conf-flint.1)
- + echo #include  "flint/fmpz_poly.h"
+ /home/opam/.opam/opam-init/hooks/sandbox.sh "build" "sh" "-exc" "cc -c $CFLAGS -I/usr/local/include test.c" (CWD=/home/opam/.opam/4.12/.opam-switch/build/conf-gmp.4)
- + cc -c -I/usr/local/include test.c
-> compiled  conf-gmp.4
Processing 15/46: [conf-arb: sh] [conf-flint: sh] [conf-pkg-config: pkg-config]
-> installed conf-gmp.4
Processing 16/46: [conf-arb: sh] [conf-flint: sh] [conf-pkg-config: pkg-config]
+ /home/opam/.opam/opam-init/hooks/sandbox.sh "build" "pkg-config" "--help" (CWD=/home/opam/.opam/4.12/.opam-switch/build/conf-pkg-config.3)
- usage: pkgconf [OPTIONS] [LIBRARIES]
- 
- basic options:
- 
-   --help                            this message
-   --about                           print pkgconf version and license to stdout
-   --version                         print supported pkg-config version to stdout
-   --atleast-pkgconfig-version       check whether or not pkgconf is compatible
-                                     with a specified pkg-config version
-   --errors-to-stdout                print all errors on stdout instead of stderr
-   --print-errors                    ensure all errors are printed
-   --short-errors                    be less verbose about some errors
-   --silence-errors                  explicitly be silent about errors
-   --list-all                        list all known packages
-   --list-package-names              list all known package names
-   --simulate                        simulate walking the calculated dependency graph
-   --no-cache                        do not cache already seen packages when
-                                     walking the dependency graph
-   --log-file=filename               write an audit log to a specified file
-   --with-path=path                  adds a directory to the search path
-   --define-prefix                   override the prefix variable with one that is guessed based on
-                                     the location of the .pc file
-   --dont-define-prefix              do not override the prefix variable under any circumstances
-   --prefix-variable=varname         sets the name of the variable that pkgconf considers
-                                     to be the package prefix
-   --relocate=path                   relocates a path and exits (mostly for testsuite)
-   --dont-relocate-paths             disables path relocation support
- 
- cross-compilation personality support:
- 
-   --personality=triplet|filename    sets the personality to 'triplet' or a file named 'filename'
-   --dump-personality                dumps details concerning selected personality
- 
- checking specific pkg-config database entries:
- 
-   --atleast-version                 require a specific version of a module
-   --exact-version                   require an exact version of a module
-   --max-version                     require a maximum version of a module
-   --exists                          check whether or not a module exists
-   --uninstalled                     check whether or not an uninstalled module will be used
-   --no-uninstalled                  never use uninstalled modules when satisfying dependencies
-   --no-provides                     do not use 'provides' rules to resolve dependencies
-   --maximum-traverse-depth          maximum allowed depth for dependency graph
-   --static                          be more aggressive when computing dependency graph
-                                     (for static linking)
-   --shared                          use a simplified dependency graph (usually default)
-   --pure                            optimize a static dependency graph as if it were a normal
-                                     dependency graph
-   --env-only                        look only for package entries in PKG_CONFIG_PATH
-   --ignore-conflicts                ignore 'conflicts' rules in modules
-   --validate                        validate specific .pc files for correctness
- 
- querying specific pkg-config database fields:
- 
-   --define-variable=varname=value   define variable 'varname' as 'value'
-   --variable=varname                print specified variable entry to stdout
-   --cflags                          print required CFLAGS to stdout
-   --cflags-only-I                   print required include-dir CFLAGS to stdout
-   --cflags-only-other               print required non-include-dir CFLAGS to stdout
-   --libs                            print required linker flags to stdout
-   --libs-only-L                     print required LDPATH linker flags to stdout
-   --libs-only-l                     print required LIBNAME linker flags to stdout
-   --libs-only-other                 print required other linker flags to stdout
-   --print-requires                  print required dependency frameworks to stdout
-   --print-requires-private          print required dependency frameworks for static
-                                     linking to stdout
-   --print-provides                  print provided dependencies to stdout
-   --print-variables                 print all known variables in module to stdout
-   --digraph                         print entire dependency graph in graphviz 'dot' format
-   --keep-system-cflags              keep -I/usr/include entries in cflags output
-   --keep-system-libs                keep -L/lib:/lib/i386-linux-gnu:/lib/x86_64-linux-gnu:/lib/x86_64-linux-gnux32:/lib32:/libx32:/usr/lib:/usr/lib/i386-linux-gnu:/usr/lib/x86_64-linux-gnu:/usr/lib/x86_64-linux-gnux32:/usr/lib32:/usr/libx32 entries in libs output
-   --path                            show the exact filenames for any matching .pc files
-   --modversion                      print the specified module's version to stdout
-   --internal-cflags                 do not filter 'internal' cflags from output
- 
- filtering output:
- 
-   --msvc-syntax                     print translatable fragments in MSVC syntax
-   --fragment-filter=types           filter output fragments to the specified types
- 
- report bugs to <https://github.com/pkgconf/pkgconf/issues/new>.
-> compiled  conf-pkg-config.3
Processing 16/46: [conf-arb: sh] [conf-flint: sh]
-> installed conf-pkg-config.3
Processing 17/46: [conf-arb: sh] [conf-flint: sh]
Processing 18/46: [conf-arb: sh] [conf-flint: sh] [conf-mpfr: sh pkg-config --print-errors --exists mpfr || cc test.c -lgmp -lmpfr]
-> retrieved ctypes.0.21.1  (cached)
Processing 19/46: [conf-arb: sh] [conf-flint: sh] [conf-mpfr: sh pkg-config --print-errors --exists mpfr || cc test.c -lgmp -lmpfr]
-> retrieved integers.0.7.0  (cached)
Processing 20/46: [conf-arb: sh] [conf-flint: sh] [conf-mpfr: sh pkg-config --print-errors --exists mpfr || cc test.c -lgmp -lmpfr]
+ /home/opam/.opam/opam-init/hooks/sandbox.sh "build" "sh" "-exc" "cc -c $CFLAGS -I/usr/local/include test.c" (CWD=/home/opam/.opam/4.12/.opam-switch/build/conf-flint.1)
- + cc -c -I/usr/local/include test.c
-> compiled  conf-flint.1
Processing 20/46: [conf-arb: sh] [conf-mpfr: sh pkg-config --print-errors --exists mpfr || cc test.c -lgmp -lmpfr]
-> installed conf-flint.1
Processing 21/46: [conf-arb: sh] [conf-mpfr: sh pkg-config --print-errors --exists mpfr || cc test.c -lgmp -lmpfr]
+ /home/opam/.opam/opam-init/hooks/sandbox.sh "build" "sh" "-exc" "cc -c $CFLAGS -I/usr/local/include test.c" (CWD=/home/opam/.opam/4.12/.opam-switch/build/conf-arb.1)
- + cc -c -I/usr/local/include test.c
- In file included from /usr/include/mag.h:25,
-                  from /usr/include/arb.h:22,
-                  from test.c:1:
- /usr/include/fmpz_extras.h:208:1: error: static declaration of 'fmpz_ui_pow_ui' follows non-static declaration
-   208 | fmpz_ui_pow_ui(fmpz_t x, ulong b, ulong e)
-       | ^~~~~~~~~~~~~~
- In file included from /usr/include/mag.h:24:
- /usr/include/flint/fmpz.h:422:6: note: previous declaration of 'fmpz_ui_pow_ui' with type 'void(fmpz *, mp_limb_t,  mp_limb_t)' {aka 'void(long int *, long unsigned int,  long unsigned int)'}
-   422 | void fmpz_ui_pow_ui(fmpz_t x, ulong b, ulong e);
-       |      ^~~~~~~~~~~~~~
- In file included from /usr/include/mag.h:501:
- /usr/include/fmpr.h: In function 'fmpr_set_ui':
- /usr/include/fmpr.h:360:11: error: 'count_trailing_zeros' is deprecated. Use 'flint_ctz' instead.
-   360 |         count_trailing_zeros(b, c);
-       |           ^~~~~~~~~~~~~~~~~~~~~~~~~                                       
- /usr/include/fmpr.h: In function 'fmpr_set_si':
- /usr/include/fmpr.h:375:11: error: 'count_trailing_zeros' is deprecated. Use 'flint_ctz' instead.
-   375 |         count_trailing_zeros(b, c);
-       |           ^~~~~~~~~~~~~~~~~~~~~~~~~                                       
- In file included from /usr/include/arb.h:23:
- /usr/include/arf.h: In function 'arf_init_set_ui':
- /usr/include/arf.h:435:11: error: 'count_leading_zeros' is deprecated. Use 'flint_clz' instead.
-   435 |         count_leading_zeros(c, v);
-       |           ^~~~~~~~~~~~~~~~~~~~~~~~                                       
- /usr/include/arf.h: In function 'arf_set_ui':
- /usr/include/arf.h:467:11: error: 'count_leading_zeros' is deprecated. Use 'flint_clz' instead.
-   467 |         count_leading_zeros(c, v);
-       |           ^~~~~~~~~~~~~~~~~~~~~~~~                                       
- /usr/include/arf.h: In function 'arf_bits':
- /usr/include/arf.h:656:11: error: 'count_trailing_zeros' is deprecated. Use 'flint_ctz' instead.
-   656 |         count_trailing_zeros(c, xp[0]);
-       |           ^~~~~~~~~~~~~~~~~~~~~~~~~~~~~                                   
- /usr/include/arb.h: In function '_arb_mpn_leading_zeros':
- /usr/include/arb.h:1041:11: error: 'count_leading_zeros' is deprecated. Use 'flint_clz' instead.
-  1041 |             count_leading_zeros(bits, t);
-       |           ^ ~~~~~~~~~~~~~~~~~~~~~~~~~~~~~                                
Processing 21/46: [conf-mpfr: sh pkg-config --print-errors --exists mpfr || cc test.c -lgmp -lmpfr]
[ERROR] The compilation of conf-arb.1 failed at "sh -exc cc -c $CFLAGS -I/usr/local/include test.c".
Processing 22/46: [conf-mpfr: sh pkg-config --print-errors --exists mpfr || cc test.c -lgmp -lmpfr]
+ /home/opam/.opam/opam-init/hooks/sandbox.sh "build" "sh" "-exc" "pkg-config --print-errors --exists mpfr || cc test.c -lgmp -lmpfr" (CWD=/home/opam/.opam/4.12/.opam-switch/build/conf-mpfr.3)
- + pkg-config --print-errors --exists mpfr
-> compiled  conf-mpfr.3
Processing 22/46:
-> installed conf-mpfr.3
Processing 23/46:
-> retrieved ocamlfind.1.9.6  (cached)
Processing 24/46:
[ocamlfind: patch] applying 0001-Harden-test-for-OCaml-5.patch
Processing 25/46: [ocamlfind: patch]
-> retrieved stdlib-shims.0.3.0  (cached)
-> retrieved zarith.1.13  (cached)
Processing 25/46: [ocamlfind: ./configure]
+ /home/opam/.opam/opam-init/hooks/sandbox.sh "build" "./configure" "-bindir" "/home/opam/.opam/4.12/bin" "-sitelib" "/home/opam/.opam/4.12/lib" "-mandir" "/home/opam/.opam/4.12/man" "-config" "/home/opam/.opam/4.12/lib/findlib.conf" "-no-custom" "-no-camlp4" (CWD=/home/opam/.opam/4.12/.opam-switch/build/ocamlfind.1.9.6)
- Welcome to findlib version 1.9.6
- Configuring core...
- Checking for #remove_directory...
- Testing threading model...
- systhread_supported: true
- Testing DLLs...
- Testing whether ppxopt can be supported...
- Checking for ocamlc -opaque...
- Checking for ocamlopt -g...
- Querying installation: META list not found
- make install will double-check installed META files
- Configuring libraries...
- unix: found
- dynlink: found
- bigarray: found
- compiler-libs: found
- dbm: not present (normal since 4.00)
- graphics: not present (normal since 4.09)
- num: not present (normal since 4.06)
- ocamlbuild: not present (normal since 4.03)
- ocamldoc: found (in +ocamldoc)
- raw_spacetime: not present (normal since 4.12)
- threads: found (in +threads)
- str: found
- labltk: not present (normal since 4.02)
- native dynlink: found
- camlp4: disabled
- bytes: found, installing fake library
- Configuration for stdlib written to site-lib-src/stdlib/META
- Configuration for unix written to site-lib-src/unix/META
- Configuration for dynlink written to site-lib-src/dynlink/META
- Configuration for bigarray written to site-lib-src/bigarray/META
- Configuration for compiler-libs written to site-lib-src/compiler-libs/META
- Configuration for ocamldoc written to site-lib-src/ocamldoc/META
- Configuration for threads written to site-lib-src/threads/META
- Configuration for str written to site-lib-src/str/META
- Configuration for bytes written to site-lib-src/bytes/META
- Detecting compiler arguments: (extractor built) ok
- 
- About the OCAML core installation:
-     Standard library:      /home/opam/.opam/4.12/lib/ocaml
-     Binaries:              /home/opam/.opam/4.12/bin
-     Manual pages:          /home/opam/.opam/4.12/man
-     Multi-threading type:  posix
- The directory of site-specific packages will be
-     site-lib:              /home/opam/.opam/4.12/lib
- The configuration file is written to:
-     findlib config file:   /home/opam/.opam/4.12/lib/findlib.conf
- Software will be installed:
-     Libraries:             in <site-lib>/findlib
-     Binaries:              /home/opam/.opam/4.12/bin
-     Manual pages:          /home/opam/.opam/4.12/man
-     topfind script:        /home/opam/.opam/4.12/lib/ocaml
- Topfind ppxopt support:    yes
- Toolbox:                   no
- Link custom runtime:       no
- Need bytes compatibility:  no
- 
- Configuration has been written to Makefile.config
- 
- You can now do 'make all', and optionally 'make opt', to build ocamlfind.
Processing 25/46: [ocamlfind: make all]
-> retrieved dune.3.13.1, dune-configurator.3.13.1  (cached)
Processing 26/46: [dune: ocaml 255] [ocamlfind: make all]
+ /home/opam/.opam/opam-init/hooks/sandbox.sh "build" "make" "all" (CWD=/home/opam/.opam/4.12/.opam-switch/build/ocamlfind.1.9.6)
- for p in findlib; do ( cd src/$p; make all ) || exit; done
- make[1]: Entering directory '/home/opam/.opam/4.12/.opam-switch/build/ocamlfind.1.9.6/src/findlib'
- ocamllex fl_meta.mll
- 22 states, 392 transitions, table size 1700 bytes
- USE_CYGPATH="0"; \
- export USE_CYGPATH; \
- cat findlib_config.mlp | \
-          ../../tools/patch '@CONFIGFILE@' '/home/opam/.opam/4.12/lib/findlib.conf' | \
-          ../../tools/patch '@STDLIB@' '/home/opam/.opam/4.12/lib/ocaml' | \
- 	sed -e 's;@AUTOLINK@;true;g' \
- 	    -e 's;@SYSTEM@;linux;g' \
- 	     >findlib_config.ml
- if [ "true" = "true" ]; then                 \
- 	cp topfind.ml.in topfind.ml;                             \
- else                                                             \
- 	sed -e '/PPXOPT_BEGIN/,/PPXOPT_END/ d' topfind.ml.in     \
- 		> topfind.ml ;                                   \
- fi
- ocamldep *.ml *.mli >depend
- ocamlc -I +compiler-libs -opaque   -I +unix -I +dynlink -g -c findlib_config.ml
- ocamlc -I +compiler-libs -opaque   -I +unix -I +dynlink -g -c fl_split.ml
- ocamlc -I +compiler-libs -opaque   -I +unix -I +dynlink -g -c fl_metatoken.ml
- ocamlc -I +compiler-libs -opaque   -I +unix -I +dynlink -g -c fl_meta.ml
- ocamlc -I +compiler-libs -opaque   -I +unix -I +dynlink -c fl_metascanner.mli
- ocamlc -I +compiler-libs -opaque   -I +unix -I +dynlink -g -c fl_metascanner.ml
- ocamlc -I +compiler-libs -opaque   -I +unix -I +dynlink -c fl_topo.mli
- ocamlc -I +compiler-libs -opaque   -I +unix -I +dynlink -g -c fl_topo.ml
- ocamlc -I +compiler-libs -opaque   -I +unix -I +dynlink -c fl_package_base.mli
- ocamlc -I +compiler-libs -opaque   -I +unix -I +dynlink -g -c fl_package_base.ml
- ocamlc -I +compiler-libs -opaque   -I +unix -I +dynlink -c findlib.mli
- ocamlc -I +compiler-libs -opaque   -I +unix -I +dynlink -g -c findlib.ml
- ocamlc -I +compiler-libs -opaque   -I +unix -I +dynlink -g -c fl_args.ml
- ocamlc -I +compiler-libs -opaque   -I +unix -I +dynlink -g -c fl_lint.ml
- ocamlc -I +compiler-libs -a -o findlib.cma findlib_config.cmo fl_split.cmo fl_metatoken.cmo fl_meta.cmo fl_metascanner.cmo fl_topo.cmo fl_package_base.cmo findlib.cmo fl_args.cmo fl_lint.cmo
- ocamlc -I +compiler-libs -opaque   -I +unix -I +dynlink -g -c ocaml_args.ml
- ocamlc -I +compiler-libs -opaque   -I +unix -I +dynlink -g -c frontend.ml
- ocamlc -I +compiler-libs  -o ocamlfind -g findlib.cma unix.cma \
-            -I +unix -I +dynlink ocaml_args.cmo frontend.cmo
- ocamlc -I +compiler-libs -opaque   -I +unix -I +dynlink -c topfind.mli
- ocamlc -I +compiler-libs -opaque   -I +unix -I +dynlink -g -c topfind.ml
- ocamlc -I +compiler-libs -a -o findlib_top.cma topfind.cmo
- USE_CYGPATH="0"; \
- export USE_CYGPATH; \
- cat topfind_rd1.p | \
-          ../../tools/patch '@SITELIB@' '/home/opam/.opam/4.12/lib' \
-     	    >topfind
- ocamlc -I +compiler-libs -opaque   -I +unix -I +dynlink -c fl_dynload.mli
- ocamlc -I +compiler-libs -opaque   -I +unix -I +dynlink -g -c fl_dynload.ml
- ocamlc -I +compiler-libs -a -o findlib_dynload.cma fl_dynload.cmo
- make[1]: Leaving directory '/home/opam/.opam/4.12/.opam-switch/build/ocamlfind.1.9.6/src/findlib'
- make all-config
- make[1]: Entering directory '/home/opam/.opam/4.12/.opam-switch/build/ocamlfind.1.9.6'
- USE_CYGPATH="0"; \
- export USE_CYGPATH; \
- cat findlib.conf.in | \
-      tools/patch '@SITELIB@' '/home/opam/.opam/4.12/lib' | \
- 		 tools/patch '@FINDLIB_PATH@' '/home/opam/.opam/4.12/lib' -p >findlib.conf
- if ./tools/cmd_from_same_dir ocamlc; then \
- 	echo 'ocamlc="ocamlc.opt"' >>findlib.conf; \
- fi
- if ./tools/cmd_from_same_dir ocamlopt; then \
- 	echo 'ocamlopt="ocamlopt.opt"' >>findlib.conf; \
- fi
- if ./tools/cmd_from_same_dir ocamldep; then \
- 	echo 'ocamldep="ocamldep.opt"' >>findlib.conf; \
- fi
- if ./tools/cmd_from_same_dir ocamldoc; then \
- 	echo 'ocamldoc="ocamldoc.opt"' >>findlib.conf; \
- fi
- make[1]: Leaving directory '/home/opam/.opam/4.12/.opam-switch/build/ocamlfind.1.9.6'
Processing 26/46: [dune: ocaml 255] [ocamlfind: make opt]
+ /home/opam/.opam/opam-init/hooks/sandbox.sh "build" "make" "opt" (CWD=/home/opam/.opam/4.12/.opam-switch/build/ocamlfind.1.9.6)
- for p in findlib; do ( cd src/$p; make opt ) || exit; done
- make[1]: Entering directory '/home/opam/.opam/4.12/.opam-switch/build/ocamlfind.1.9.6/src/findlib'
- ocamlopt -I +compiler-libs -g -opaque  -I +unix -I +dynlink -c findlib_config.ml
- ocamlopt -I +compiler-libs -g -opaque  -I +unix -I +dynlink -c fl_split.ml
- ocamlopt -I +compiler-libs -g -opaque  -I +unix -I +dynlink -c fl_metatoken.ml
- ocamlopt -I +compiler-libs -g -opaque  -I +unix -I +dynlink -c fl_meta.ml
- ocamlopt -I +compiler-libs -g -opaque  -I +unix -I +dynlink -c fl_metascanner.ml
- ocamlopt -I +compiler-libs -g -opaque  -I +unix -I +dynlink -c fl_topo.ml
- ocamlopt -I +compiler-libs -g -opaque  -I +unix -I +dynlink -c fl_package_base.ml
- ocamlopt -I +compiler-libs -g -opaque  -I +unix -I +dynlink -c findlib.ml
- ocamlopt -I +compiler-libs -g -opaque  -I +unix -I +dynlink -c fl_args.ml
- ocamlopt -I +compiler-libs -g -opaque  -I +unix -I +dynlink -c fl_lint.ml
- ocamlopt -I +compiler-libs -g -a -o findlib.cmxa findlib_config.cmx fl_split.cmx fl_metatoken.cmx fl_meta.cmx fl_metascanner.cmx fl_topo.cmx fl_package_base.cmx findlib.cmx fl_args.cmx fl_lint.cmx
- if [ 1 -gt 0 ]; then \
-     ocamlopt -I +compiler-libs -g -shared -o findlib.cmxs findlib_config.cmx fl_split.cmx fl_metatoken.cmx fl_meta.cmx fl_metascanner.cmx fl_topo.cmx fl_package_base.cmx findlib.cmx fl_args.cmx fl_lint.cmx; \
- fi
- ocamlopt -I +compiler-libs -g -opaque  -I +unix -I +dynlink -c ocaml_args.ml
- ocamlopt -I +compiler-libs -g -opaque  -I +unix -I +dynlink -c frontend.ml
- ocamlopt -I +compiler-libs -g -o ocamlfind_opt findlib.cmxa unix.cmxa \
- 	   -I +unix -I +dynlink ocaml_args.cmx frontend.cmx
- ocamlopt -I +compiler-libs -g -opaque  -I +unix -I +dynlink -c topfind.ml
- File "_none_", line 1:
- Warning 58 [no-cmx-file]: no cmx file was found in path for module Topdirs, and its interface was not compiled with -opaque
- File "_none_", line 1:
- Warning 58 [no-cmx-file]: no cmx file was found in path for module Toploop, and its interface was not compiled with -opaque
- ocamlopt -I +compiler-libs -g -a -o findlib_top.cmxa topfind.cmx
- if [ 1 -gt 0 ]; then \
-     ocamlopt -I +compiler-libs -g -shared -o findlib_top.cmxs topfind.cmx; \
- fi
- ocamlopt -I +compiler-libs -g -opaque  -I +unix -I +dynlink -c fl_dynload.ml
- ocamlopt -I +compiler-libs -g -a -o findlib_dynload.cmxa fl_dynload.cmx
- if [ 1 -gt 0 ]; then \
-     ocamlopt -I +compiler-libs -g -shared -o findlib_dynload.cmxs fl_dynload.cmx; \
- fi
- make[1]: Leaving directory '/home/opam/.opam/4.12/.opam-switch/build/ocamlfind.1.9.6/src/findlib'
-> compiled  ocamlfind.1.9.6
Processing 26/46: [dune: ocaml 255]
Processing 27/46: [dune: ocaml 255] [ocamlfind: make install]
+ /home/opam/.opam/opam-init/hooks/sandbox.sh "install" "make" "install" (CWD=/home/opam/.opam/4.12/.opam-switch/build/ocamlfind.1.9.6)
- if [ "1" -eq 1 ]; then \
-     for x in camlp4 dbm graphics labltk num ocamlbuild; do \
-       if [ -f "/home/opam/.opam/4.12/lib/$x/META" ]; then \
-         if ! grep -Fq '[distributed with Ocaml]' "//home/opam/.opam/4.12/lib/$x/META"; then \
-           rm -f site-lib-src/$x/META; \
-         fi; \
-       fi; \
-     done; \
-     test -f "site-lib-src/num/META" || rm -f "site-lib-src/num-top/META"; \
-   fi
- echo 'SITELIB_META =' > Makefile.packages.in
- for x in `ls site-lib-src`; do test ! -f "site-lib-src/$x/META" || echo $x >> Makefile.packages.in; done
- tr '\n' ' ' < Makefile.packages.in > Makefile.packages
- rm Makefile.packages.in
- install -d "/home/opam/.opam/4.12/bin"
- install -d "/home/opam/.opam/4.12/man"
- make install-config
- make[1]: Entering directory '/home/opam/.opam/4.12/.opam-switch/build/ocamlfind.1.9.6'
- install -d "`dirname \"/home/opam/.opam/4.12/lib/findlib.conf\"`"
- test -f "/home/opam/.opam/4.12/lib/findlib.conf" || install -c findlib.conf "/home/opam/.opam/4.12/lib/findlib.conf"
- make[1]: Leaving directory '/home/opam/.opam/4.12/.opam-switch/build/ocamlfind.1.9.6'
- for p in findlib; do ( cd src/$p; make install ); done
- make[1]: Entering directory '/home/opam/.opam/4.12/.opam-switch/build/ocamlfind.1.9.6/src/findlib'
- install -d "/home/opam/.opam/4.12/lib/findlib"
- install -d "/home/opam/.opam/4.12/bin"
- test 1 -eq 0 || install -d "/home/opam/.opam/4.12/lib/ocaml"
- test 1 -eq 0 || install -c topfind "/home/opam/.opam/4.12/lib/ocaml/"
- files=` ../../tools/collect_files ../../Makefile.config \
- findlib.cmi findlib.mli findlib.cma findlib.cmxa findlib.a findlib.cmxs \
- findlib_config.cmi findlib_config.ml topfind.cmi topfind.mli \
- fl_args.cmi fl_lint.cmi fl_meta.cmi fl_split.cmi fl_topo.cmi ocaml_args.cmi \
- fl_package_base.mli fl_package_base.cmi fl_metascanner.mli fl_metascanner.cmi \
- fl_metatoken.cmi findlib_top.cma findlib_top.cmxa findlib_top.a findlib_top.cmxs \
- findlib_dynload.cma findlib_dynload.cmxa findlib_dynload.a findlib_dynload.cmxs fl_dynload.mli fl_dynload.cmi \
- META` && \
- install -c $files "/home/opam/.opam/4.12/lib/findlib/"
- f="ocamlfind"; { test -f ocamlfind_opt && f="ocamlfind_opt"; }; \
- install -c $f "/home/opam/.opam/4.12/bin/ocamlfind"
- # the following "if" block is only needed for 4.00beta2
- if [ 1 -eq 0 -a -f "/home/opam/.opam/4.12/lib/ocaml/compiler-libs/topdirs.cmi" ]; then \
-     cd "/home/opam/.opam/4.12/lib/ocaml/compiler-libs/"; \
-     install -c topdirs.cmi toploop.cmi "/home/opam/.opam/4.12/lib/findlib/"; \
- fi
- make[1]: Leaving directory '/home/opam/.opam/4.12/.opam-switch/build/ocamlfind.1.9.6/src/findlib'
- make install-meta
- make[1]: Entering directory '/home/opam/.opam/4.12/.opam-switch/build/ocamlfind.1.9.6'
- for x in bigarray bytes compiler-libs dynlink ocamldoc stdlib str threads unix ; do install -d "/home/opam/.opam/4.12/lib/$x"; install -c site-lib-src/$x/META "/home/opam/.opam/4.12/lib/$x/META.tmp" && mv "/home/opam/.opam/4.12/lib/$x/META.tmp" "/home/opam/.opam/4.12/lib/$x/META"; done
- install -d "/home/opam/.opam/4.12/lib/findlib"; install -c Makefile.packages "/home/opam/.opam/4.12/lib/findlib/Makefile.packages"
- make[1]: Leaving directory '/home/opam/.opam/4.12/.opam-switch/build/ocamlfind.1.9.6'
- test ! -f 'site-lib-src/num-top/META' || { cd src/findlib; make install-num-top; }
- test ! -f 'site-lib-src/camlp4/META' ||	install -c tools/safe_camlp4 "/home/opam/.opam/4.12/bin"
- make install-doc
- make[1]: Entering directory '/home/opam/.opam/4.12/.opam-switch/build/ocamlfind.1.9.6'
- install -d "/home/opam/.opam/4.12/man/man1" "/home/opam/.opam/4.12/man/man3" "/home/opam/.opam/4.12/man/man5"
- install -c doc/ref-man/ocamlfind.1 "/home/opam/.opam/4.12/man/man1"
- install -c doc/ref-man/META.5 doc/ref-man/site-lib.5 doc/ref-man/findlib.conf.5 "/home/opam/.opam/4.12/man/man5"
- make[1]: Leaving directory '/home/opam/.opam/4.12/.opam-switch/build/ocamlfind.1.9.6'
-> installed ocamlfind.1.9.6
Processing 27/46: [dune: ocaml 255]
Processing 28/46: [dune: ocaml 255] [zarith: ./configure]
+ /home/opam/.opam/opam-init/hooks/sandbox.sh "build" "./configure" (CWD=/home/opam/.opam/4.12/.opam-switch/build/zarith.1.13)
- binary ocaml: found in /home/opam/.opam/4.12/bin
- binary ocamlc: found in /home/opam/.opam/4.12/bin
- binary ocamldep: found in /home/opam/.opam/4.12/bin
- binary ocamlmklib: found in /home/opam/.opam/4.12/bin
- binary ocamldoc: found in /home/opam/.opam/4.12/bin
- binary ocamlopt: found in /home/opam/.opam/4.12/bin
- checking compilation with ocamlc -O3 -Wall -Wextra : working
- include caml/mlvalues.h: found
- library dynlink.cmxa: found
- binary ocamlfind: found in /home/opam/.opam/4.12/bin
- OCaml's word size is 64
- package gmp: found
- OCaml supports -bin-annot to produce documentation
- 
- detected configuration:
- 
-   native-code:          yes
-   dynamic linking:      yes
-   defines:              -DHAS_GMP 
-   includes:             -I/home/opam/.opam/4.12/lib/ocaml  
-   libraries:             -lgmp 
-   linker options:       
-   C options:            -O3 -Wall -Wextra 
-   installation path:    /home/opam/.opam/4.12/lib
-   installation method   findlib
- 
- configuration successful!
- now type "make" to build
- then type "make install" or "sudo make install" to install
Processing 28/46: [dune: ocaml 255] [zarith: make]
+ /home/opam/.opam/opam-init/hooks/sandbox.sh "build" "make" (CWD=/home/opam/.opam/4.12/.opam-switch/build/zarith.1.13)
- (echo "let"; grep "version" META | head -1) > zarith_version.ml
- ocamldep  zarith_version.ml z.ml q.ml big_int_Z.ml z.mli q.mli big_int_Z.mli > depend
- ocamlc -g -I +compiler-libs -bin-annot  -c zarith_version.ml
- ocamlc -g -I +compiler-libs -bin-annot  -c z.mli
- ocamlc -g -I +compiler-libs -bin-annot  -c z.ml
- ocamlc -g -I +compiler-libs -bin-annot  -c q.mli
- ocamlc -g -I +compiler-libs -bin-annot  -c q.ml
- ocamlc -g -I +compiler-libs -bin-annot  -c big_int_Z.mli
- ocamlc -g -I +compiler-libs -bin-annot  -c big_int_Z.ml
- ocamlmklib -g -failsafe -o zarith zarith_version.cmo z.cmo q.cmo big_int_Z.cmo -lgmp  
- ocamlc -ccopt "-I/home/opam/.opam/4.12/lib/ocaml   -DHAS_GMP  -O3 -Wall -Wextra " -c caml_z.c
- ocamlmklib -g -failsafe -o zarith caml_z.o -lgmp  
- ocamlc -g -I +compiler-libs -bin-annot  -c zarith_top.ml
- ocamlc -g -o zarith_top.cma -a zarith_top.cmo
- ocamlopt -g -I +compiler-libs  -c zarith_version.ml
- ocamlopt -g -I +compiler-libs  -c z.ml
- ocamlopt -g -I +compiler-libs  -c q.ml
- ocamlopt -g -I +compiler-libs  -c big_int_Z.ml
- ocamlmklib -g -failsafe -o zarith zarith_version.cmx z.cmx q.cmx big_int_Z.cmx -lgmp  
- ocamlopt -shared -o zarith.cmxs -I . zarith.cmxa -linkall
-> compiled  zarith.1.13
Processing 28/46: [dune: ocaml 255]
Processing 29/46: [dune: ocaml 255] [zarith: make install]
+ /home/opam/.opam/opam-init/hooks/sandbox.sh "install" "make" "install" (CWD=/home/opam/.opam/4.12/.opam-switch/build/zarith.1.13)
- ocamlfind install -destdir "/home/opam/.opam/4.12/lib" zarith META zarith.cma libzarith.a z.cmi q.cmi big_int_Z.cmi zarith_top.cma z.mli zarith.cmxa zarith_version.cmx z.cmx q.cmx big_int_Z.cmx zarith.cmxs zarith.h q.mli big_int_Z.mli zarith.a z.cmti q.cmti big_int_Z.cmti -optional dllzarith.so
- Installed /home/opam/.opam/4.12/lib/zarith/big_int_Z.cmti
- Installed /home/opam/.opam/4.12/lib/zarith/q.cmti
- Installed /home/opam/.opam/4.12/lib/zarith/z.cmti
- Installed /home/opam/.opam/4.12/lib/zarith/zarith.a
- Installed /home/opam/.opam/4.12/lib/zarith/big_int_Z.mli
- Installed /home/opam/.opam/4.12/lib/zarith/q.mli
- Installed /home/opam/.opam/4.12/lib/zarith/zarith.h
- Installed /home/opam/.opam/4.12/lib/zarith/zarith.cmxs
- Installed /home/opam/.opam/4.12/lib/zarith/big_int_Z.cmx
- Installed /home/opam/.opam/4.12/lib/zarith/q.cmx
- Installed /home/opam/.opam/4.12/lib/zarith/z.cmx
- Installed /home/opam/.opam/4.12/lib/zarith/zarith_version.cmx
- Installed /home/opam/.opam/4.12/lib/zarith/zarith.cmxa
- Installed /home/opam/.opam/4.12/lib/zarith/z.mli
- Installed /home/opam/.opam/4.12/lib/zarith/zarith_top.cma
- Installed /home/opam/.opam/4.12/lib/zarith/big_int_Z.cmi
- Installed /home/opam/.opam/4.12/lib/zarith/q.cmi
- Installed /home/opam/.opam/4.12/lib/zarith/z.cmi
- Installed /home/opam/.opam/4.12/lib/zarith/libzarith.a
- Installed /home/opam/.opam/4.12/lib/zarith/zarith.cma
- Installed /home/opam/.opam/4.12/lib/stublibs/dllzarith.so
- Installed /home/opam/.opam/4.12/lib/stublibs/dllzarith.so.owner
- ocamlfind: [WARNING] You have installed DLLs but the directory /home/opam/.opam/4.12/lib/stublibs is not mentioned in ld.conf
- Installed /home/opam/.opam/4.12/lib/zarith/META
-> installed zarith.1.13
Processing 29/46: [dune: ocaml 255]
+ /home/opam/.opam/opam-init/hooks/sandbox.sh "build" "ocaml" "boot/bootstrap.ml" "-j" "255" (CWD=/home/opam/.opam/4.12/.opam-switch/build/dune.3.13.1)
- ocamlc -output-complete-exe -w -24 -g -o .duneboot.exe -I boot unix.cma boot/libs.ml boot/duneboot.ml
- ./.duneboot.exe -j 255
- cd _boot && /home/opam/.opam/4.12/bin/ocamlopt.opt -c -g -no-alias-deps -w -49-6 -alert -unstable -I +threads opamLocal.ml
- File "vendor/opam/src/repository/opamLocal.ml", lines 109-114, characters 46-34:
- Warning 8 [partial-match]: this pattern-matching is not exhaustive.
- Here is an example of a case that is not matched:
- Checksum_mismatch _
- File "vendor/opam/src/repository/opamLocal.ml", lines 170-189, characters 44-56:
- Warning 8 [partial-match]: this pattern-matching is not exhaustive.
- Here is an example of a case that is not matched:
- Checksum_mismatch _
- File "vendor/opam/src/repository/opamLocal.ml", lines 209-231, characters 8-44:
- Warning 8 [partial-match]: this pattern-matching is not exhaustive.
- Here is an example of a case that is not matched:
- Checksum_mismatch _
- cd _boot && /home/opam/.opam/4.12/bin/ocamlopt.opt -c -g -no-alias-deps -w -49-6 -alert -unstable -I +threads opamVCS.ml
- File "vendor/opam/src/repository/opamVCS.ml", lines 179-182, characters 11-40:
- Warning 8 [partial-match]: this pattern-matching is not exhaustive.
- Here is an example of a case that is not matched:
- Checksum_mismatch _
- cd _boot && /home/opam/.opam/4.12/bin/ocamlopt.opt -c -g -no-alias-deps -w -49-6 -alert -unstable -I +threads opamDownload.ml
- File "vendor/opam/src/repository/opamDownload.ml", lines 323-361, characters 42-41:
- Warning 8 [partial-match]: this pattern-matching is not exhaustive.
- Here is an example of a case that is not matched:
- Checksum_mismatch _
- cd _boot && /home/opam/.opam/4.12/bin/ocamlopt.opt -c -g -no-alias-deps -w -49-6 -alert -unstable -I +threads opamRepository.ml
- File "vendor/opam/src/repository/opamRepository.ml", lines 88-90, characters 45-77:
- Warning 8 [partial-match]: this pattern-matching is not exhaustive.
- Here is an example of a case that is not matched:
- Checksum_mismatch _
- File "vendor/opam/src/repository/opamRepository.ml", lines 277-281, characters 38-17:
- Warning 8 [partial-match]: this pattern-matching is not exhaustive.
- Here is an example of a case that is not matched:
- Checksum_mismatch _
- File "vendor/opam/src/repository/opamRepository.ml", lines 423-427, characters 12-42:
- Warning 8 [partial-match]: this pattern-matching is not exhaustive.
- Here is an example of a case that is not matched:
- (_, Checksum_mismatch _)
- 

Processing 29/46: [dune: ./_boot/dune.exe build]
+ /home/opam/.opam/opam-init/hooks/sandbox.sh "build" "./_boot/dune.exe" "build" "dune.install" "--release" "--profile" "dune-bootstrap" "-j" "255" (CWD=/home/opam/.opam/4.12/.opam-switch/build/dune.3.13.1)
-> compiled  dune.3.13.1
-> installed dune.3.13.1
Processing 31/46: [bigarray-compat: dune build]
Processing 32/46: [bigarray-compat: dune build] [csexp: dune build]
Processing 33/46: [bigarray-compat: dune build] [csexp: dune build] [stdlib-shims: dune build]
+ /home/opam/.opam/opam-init/hooks/sandbox.sh "build" "dune" "build" "-p" "stdlib-shims" "-j" "255" (CWD=/home/opam/.opam/4.12/.opam-switch/build/stdlib-shims.0.3.0)
-> compiled  stdlib-shims.0.3.0
Processing 33/46: [bigarray-compat: dune build] [csexp: dune build]
-> installed stdlib-shims.0.3.0
Processing 34/46: [bigarray-compat: dune build] [csexp: dune build]
Processing 35/46: [bigarray-compat: dune build] [csexp: dune build] [integers: dune build]
+ /home/opam/.opam/opam-init/hooks/sandbox.sh "build" "dune" "build" "-p" "csexp" "-j" "255" "@install" (CWD=/home/opam/.opam/4.12/.opam-switch/build/csexp.1.5.2)
-> compiled  csexp.1.5.2
Processing 35/46: [bigarray-compat: dune build] [integers: dune build]
-> installed csexp.1.5.2
Processing 36/46: [bigarray-compat: dune build] [integers: dune build]
Processing 37/46: [bigarray-compat: dune build] [dune-configurator: rm] [integers: dune build]
+ /home/opam/.opam/opam-init/hooks/sandbox.sh "build" "dune" "build" "-p" "bigarray-compat" "-j" "255" (CWD=/home/opam/.opam/4.12/.opam-switch/build/bigarray-compat.1.1.0)
-> compiled  bigarray-compat.1.1.0
Processing 37/46: [dune-configurator: rm] [integers: dune build]
-> installed bigarray-compat.1.1.0
Processing 38/46: [dune-configurator: rm] [integers: dune build]
+ /home/opam/.opam/opam-init/hooks/sandbox.sh "build" "dune" "build" "-p" "integers" "-j" "255" (CWD=/home/opam/.opam/4.12/.opam-switch/build/integers.0.7.0)
-> compiled  integers.0.7.0
Processing 38/46: [dune-configurator: rm]
-> installed integers.0.7.0
Processing 39/46: [dune-configurator: rm]
+ /home/opam/.opam/opam-init/hooks/sandbox.sh "build" "rm" "-rf" "vendor/csexp" (CWD=/home/opam/.opam/4.12/.opam-switch/build/dune-configurator.3.13.1)
+ /home/opam/.opam/opam-init/hooks/sandbox.sh "build" "rm" "-rf" "vendor/pp" (CWD=/home/opam/.opam/4.12/.opam-switch/build/dune-configurator.3.13.1)
Processing 39/46: [dune-configurator: dune build]
+ /home/opam/.opam/opam-init/hooks/sandbox.sh "build" "dune" "build" "-p" "dune-configurator" "-j" "255" "@install" (CWD=/home/opam/.opam/4.12/.opam-switch/build/dune-configurator.3.13.1)
-> compiled  dune-configurator.3.13.1
-> installed dune-configurator.3.13.1
Processing 41/46: [ctypes: dune build]
+ /home/opam/.opam/opam-init/hooks/sandbox.sh "build" "dune" "build" "-p" "ctypes" "-j" "255" "--promote-install-files=false" "@install" (CWD=/home/opam/.opam/4.12/.opam-switch/build/ctypes.0.21.1)
- (cd _build/default && /home/opam/.opam/4.12/bin/ocamlopt.opt -w -40 -g -I src/ctypes-top/.ctypes_top.objs/byte -I src/ctypes-top/.ctypes_top.objs/native -I /home/opam/.opam/4.12/lib/bigarray-compat -I /home/opam/.opam/4.12/lib/integers -I /home/opam/.opam/4.12/lib/ocaml/compiler-libs -I /home/opam/.opam/4.12/lib/stdlib-shims -I src/ctypes/.ctypes.objs/byte -I src/ctypes/.ctypes.objs/native -intf-suffix .ml -no-alias-deps -open Ctypes_top -o src/ctypes-top/.ctypes_top.objs/native/ctypes_top__Install_ctypes_printers.cmx -c -impl src/ctypes-top/install_ctypes_printers.ml)
- File "_none_", line 1:
- Warning 58 [no-cmx-file]: no cmx file was found in path for module Toploop, and its interface was not compiled with -opaque
Processing 41/46: [ctypes: dune install]
+ /home/opam/.opam/opam-init/hooks/sandbox.sh "build" "dune" "install" "-p" "ctypes" "--create-install-files" "ctypes" (CWD=/home/opam/.opam/4.12/.opam-switch/build/ctypes.0.21.1)
-> compiled  ctypes.0.21.1
-> installed ctypes.0.21.1
Processing 43/46: [flint: dune build]
+ /home/opam/.opam/opam-init/hooks/sandbox.sh "build" "dune" "build" "-p" "flint" "-j" "255" "@install" (CWD=/home/opam/.opam/4.12/.opam-switch/build/flint.0.3.2)
-> compiled  flint.0.3.2
-> installed flint.0.3.2

#=== ERROR while compiling conf-arb.1 =========================================#
# context              2.2.0~beta2~dev | linux/x86_64 | ocaml-base-compiler.4.12.1 | file:///home/opam/opam-repository
# path                 ~/.opam/4.12/.opam-switch/build/conf-arb.1
# command              ~/.opam/opam-init/hooks/sandbox.sh build sh -exc cc -c $CFLAGS -I/usr/local/include test.c
# exit-code            1
# env-file             ~/.opam/log/conf-arb-8-4e7d06.env
# output-file          ~/.opam/log/conf-arb-8-4e7d06.out
### output ###
# + cc -c -I/usr/local/include test.c
# In file included from /usr/include/mag.h:25,
#                  from /usr/include/arb.h:22,
#                  from test.c:1:
# /usr/include/fmpz_extras.h:208:1: error: static declaration of 'fmpz_ui_pow_ui' follows non-static declaration
#   208 | fmpz_ui_pow_ui(fmpz_t x, ulong b, ulong e)
#       | ^~~~~~~~~~~~~~
# In file included from /usr/include/mag.h:24:
# /usr/include/flint/fmpz.h:422:6: note: previous declaration of 'fmpz_ui_pow_ui' with type 'void(fmpz *, mp_limb_t,  mp_limb_t)' {aka 'void(long int *, long unsigned int,  long unsigned int)'}
#   422 | void fmpz_ui_pow_ui(fmpz_t x, ulong b, ulong e);
#       |      ^~~~~~~~~~~~~~
# In file included from /usr/include/mag.h:501:
# /usr/include/fmpr.h: In function 'fmpr_set_ui':
# /usr/include/fmpr.h:360:11: error: 'count_trailing_zeros' is deprecated. Use 'flint_ctz' instead.
#   360 |         count_trailing_zeros(b, c);
#       |           ^~~~~~~~~~~~~~~~~~~~~~~~~                                       
# /usr/include/fmpr.h: In function 'fmpr_set_si':
# /usr/include/fmpr.h:375:11: error: 'count_trailing_zeros' is deprecated. Use 'flint_ctz' instead.
#   375 |         count_trailing_zeros(b, c);
#       |           ^~~~~~~~~~~~~~~~~~~~~~~~~                                       
# In file included from /usr/include/arb.h:23:
# /usr/include/arf.h: In function 'arf_init_set_ui':
# /usr/include/arf.h:435:11: error: 'count_leading_zeros' is deprecated. Use 'flint_clz' instead.
#   435 |         count_leading_zeros(c, v);
#       |           ^~~~~~~~~~~~~~~~~~~~~~~~                                       
# /usr/include/arf.h: In function 'arf_set_ui':
# /usr/include/arf.h:467:11: error: 'count_leading_zeros' is deprecated. Use 'flint_clz' instead.
#   467 |         count_leading_zeros(c, v);
#       |           ^~~~~~~~~~~~~~~~~~~~~~~~                                       
# /usr/include/arf.h: In function 'arf_bits':
# /usr/include/arf.h:656:11: error: 'count_trailing_zeros' is deprecated. Use 'flint_ctz' instead.
#   656 |         count_trailing_zeros(c, xp[0]);
#       |           ^~~~~~~~~~~~~~~~~~~~~~~~~~~~~                                   
# /usr/include/arb.h: In function '_arb_mpn_leading_zeros':
# /usr/include/arb.h:1041:11: error: 'count_leading_zeros' is deprecated. Use 'flint_clz' instead.
#  1041 |             count_leading_zeros(bits, t);
#       |           ^ ~~~~~~~~~~~~~~~~~~~~~~~~~~~~~                                



<><> Error report <><><><><><><><><><><><><><><><><><><><><><><><><><><><><><><>
+- The following actions were aborted
| - install arb 0.3.2
+- 
+- The following actions failed
| - build conf-arb 1
+- 
+- The following changes have been performed (the rest was aborted)
| - install bigarray-compat   1.1.0
| - install conf-flint        1
| - install conf-gmp          4
| - install conf-mpfr         3
| - install conf-pkg-config   3
| - install csexp             1.5.2
| - install ctypes            0.21.1
| - install dune              3.13.1
| - install dune-configurator 3.13.1
| - install flint             0.3.2
| - install integers          0.7.0
| - install ocamlfind         1.9.6
| - install stdlib-shims      0.3.0
| - install zarith            1.13
+- 
# Run eval $(opam env) to update the current shell environment

The former state can be restored with:
    /usr/bin/opam switch import "/home/opam/.opam/4.12/.opam-switch/backup/state-20240207105332.export"
'opam install -vy arb.0.3.2' failed.
"/usr/bin/env" "bash" "-c" "
opam remove -y "arb.0.3.2"
opam install -vy "arb.0.3.2"
res=$?
if [ $res = 31 ]; then
    if opam show -f x-ci-accept-failures: "arb.0.3.2" | grep -q '"debian-unstable"'; then
        echo "This package failed and has been disabled for CI using the 'x-ci-accept-failures' field."
        exit 69
    fi
fi


exit $res
" failed with exit status 31
Failed: Build failed